{"text_format":"1","workbook":"xlsx","n_sheets":5,"sheets":["Instructions","Phase 1","TABLE","Phase 2","Phase 3"],"not_rendered":{"charts":0,"images":1,"macros":1,"external_links":0,"defined_names":5,"comments":0,"pivot_tables":0},"unopened":[],"bounds":{"document_bytes":16777216,"sheet_cells":100000,"rows_first":2000,"rows_last":500,"rows_between":2000,"halvings":0,"cell_chars":16384,"cell_head_chars":4096},"cells_cut":0,"cells_raw":0,"read":"whole","date_system":"1900"}

{"sheet":"Instructions","index":0,"n_rows":24,"n_cols":2,"rows_kept":24,"cut":false,"hidden":false,"merged":[[1,0,1,1],[5,0,5,1],[0,0,0,1],[2,0,2,1],[4,0,4,1],[3,0,3,1]]}
[" State of New Mexico ARCHITECT RATE SCHEDULE CALCULATION SHEET NOTES"]
["THIS FILE MAY BE USED FOR SINGLE OR MULTI-PHASED DESIGN CALCULATIONS"]
["MAR = Maximum Allowable Rate"]
["NMGRT - New Mexico Gross Receipts Tax"]
["MACC = Maximum Allowable Construction Cost"]
["Note: The NM Architectural Rate Schedule only applies to MACC values between $150k and $10M.  This file provides calculations with MACC values between $100k to $30M.  When MACC values go outside the published range, the header will change to clarify that the calculations are BASED on the NM Rate Schedule."]
["In PHASE ONE tab:"]
[1,"Enter the Project Name and the Location in cells B3 and B4"]
[2,"Enter the MACC value in cell C6"]
[3,"Enter the Building Type in cell C7 (A, B, C, or D following guideline notes starting in Row 21)"]
[4,"Enter the applicable A&E office location NMGRT value in cell A10"]
[5,"In cells A12 through B18, enter the applicable project-specific efforts and percentages."]
["In PHASE TWO tab:"]
[null,"Project Name, Location, MACC, and Building Type must be completed in the Phase One tab"]
[6,"Enter the applicable A&E office location NMGRT value in cell A10"]
[7,"In cells A13 through B18, enter the applicable project-specific phases and percentages."]
[null,"If necessary, use the RESET FORMULAS macro to erase entries and start over for this tab only."]
["In PHASE THREE tab:"]
[null,"Project Name, Location, MACC, and Building Type must be completed in the Phase One tab"]
[8,"Enter the applicable A&E office location NMGRT value in cell A10"]
{"$rows_left_out":5}
{"sheet":"Phase 1","index":1,"n_rows":28,"n_cols":6,"rows_kept":28,"cut":false,"hidden":false,"merged":[[0,0,0,2],[20,0,20,2],[26,0,26,2],[2,1,2,2],[3,1,3,2],[27,0,27,2],[5,0,5,1],[6,0,6,1],[7,0,7,1],[8,0,8,1],[21,0,21,2],[22,0,22,2],[23,0,23,2],[24,0,24,2],[25,0,25,2]]}
[{"$f":"IF(OR(C6=0,C6<100000),\"State of New Mexico ARCHITECT RATE SCHEDULE CALCULATION SHEET\",IF(OR(C6<150000,C6>10000000),\"Based on State of NM ARCHITECT RATE SCHEDULE CALCULATION SHEET\",\"State of New Mexico ARCHITECT RATE SCHEDULE CALCULATION SHEET\"))","v":"State of New Mexico ARCHITECT RATE SCHEDULE CALCULATION SHEET"}]
["1.5.18 NMAC",null,"Created 6/12/2017"]
["Project:"," "]
["Location:"," "]
["Date:",{"$f":"TODAY()","v":"2017-06-12"}]
["Maximum Allowable Construction Cost (MACC) =",null,0,null,null,{"$f":"IF(C6<100000,\"MACC RANGE MUST BE BETWEEN $100K AND $30M\",IF(C6>30000000,\"MACC RANGE MUST BE BETWEEN $100K AND $30M\",\" \"))","v":"MACC RANGE MUST BE BETWEEN $100K AND $30M"}]
["Building Type Group (A, B, C, D) = ",null,"Select",{"$f":"IF(C7=\" \",0,IF(C7=\"A\",2,IF(C7=\"b\",3,IF(C7=\"c\",4,IF(C7=\"d\",5,0)))))","v":0},"Select"]
["Basic Services Fee as a Percentage of MACC =",null,{"$f":"IF(C7=\"Select\",0,VLOOKUP(C6,TABLE!A1:E809,D7))","v":0},null,"A"]
["Maximum Architect Rate (MAR) =",null,{"$f":"C6*C8","v":0},null,"B"]
[0,"= New Mexico Gross Receipts Tax Rate",{"$f":"C9*(1+A10)","v":0},null,"C"]
["Percent of Basic Fee","Design & Construction Phases","Lump Sum (without NMGRT)",null,"D"]
[0,"Programming Effort =",{"$f":"IF(C9=\"Negotiable\",\"Negotiable\",C9*A12)","v":0}]
[0,"Schematic Design Effort =",{"$f":"IF(C9=\"Negotiable\",\"Negotiable\",C9*A13)","v":0}]
[0,"Design Development Effort =",{"$f":"IF(C9=\"Negotiable\",\"Negotiable\",C9*A14)","v":0}]
[0,"Construction Documents Effort =",{"$f":"IF(C9=\"Negotiable\",\"Negotiable\",C9*A15)","v":0}]
[0,"Award of Contract Effort =",{"$f":"IF(C9=\"Negotiable\",\"Negotiable\",C9*A16)","v":0}]
[0,"Construction Effort =",{"$f":"IF(C9=\"Negotiable\",\"Negotiable\",C9*A17)","v":0}]
[0,"Closeout Effort =",{"$f":"IF(C9=\"Negotiable\",\"Negotiable\",C9*A18)","v":0}]
[{"$f":"SUM(A12:A18)","v":0},{"$f":"IF(A19=1,\"TOTAL =\",\"PHASE ONE TOTAL =\")","v":"PHASE ONE TOTAL ="},{"$f":"IF(A19>1,\"ERROR\",SUM(C12:C18))","v":0},null,null,{"$f":"IF(A19>1,\"= Value exceeds MAR value in Cell C9\",\" \")","v":" "}]
[]
{"$rows_left_out":9}
{"sheet":"TABLE","index":2,"n_rows":809,"n_cols":7,"rows_kept":809,"cut":false,"hidden":true,"merged":[]}
[null,"A","B","C","D"]
[100000,0.115,0.10100000000000001,0.09,0.08]
[{"$f":"A2+10000","v":110000},{"$f":"B4+0.0006","v":0.11439999999999989},{"$f":"C4+0.0006","v":0.10039999999999992},{"$f":"D4+0.0004","v":8.9600000000000582E-2},{"$f":"E4+0.0006","v":7.9400000000000456E-2},null,1]
[{"$f":"A3+10000","v":120000},{"$f":"B5+0.0006","v":0.11379999999999989},9.9799999999999917E-2,{"$f":"D5+0.0004","v":8.9200000000000584E-2},7.8800000000000453E-2,null,2]
[130000,{"$f":"B6+0.0006","v":0.11319999999999988},9.9199999999999913E-2,{"$f":"D6+0.0004","v":8.8800000000000587E-2},7.820000000000045E-2,null,3]
[140000,{"$f":"B7+0.0006","v":0.11259999999999988},9.859999999999991E-2,{"$f":"D7+0.0004","v":8.8400000000000589E-2},7.7600000000000446E-2,null,4]
[150000,{"$f":"B8+0.0006","v":0.11199999999999988},9.7999999999999907E-2,{"$f":"D8+0.0006","v":8.8000000000000592E-2},7.7000000000000443E-2,null,5]
[160000,{"$f":"B9+0.0006","v":0.11139999999999987},9.7399999999999903E-2,8.7400000000000588E-2,7.640000000000044E-2,null,6]
[170000,{"$f":"B10+0.0006","v":0.11079999999999987},9.67999999999999E-2,8.6800000000000585E-2,7.5800000000000436E-2,null,7]
[{"$f":"A9+10000","v":180000},{"$f":"B11+0.0006","v":0.11019999999999987},9.6199999999999897E-2,8.6200000000000582E-2,7.5200000000000433E-2,null,8]
[190000,{"$f":"B12+0.0006","v":0.10959999999999986},9.5599999999999893E-2,8.5600000000000578E-2,7.460000000000043E-2,null,10]
[{"$f":"A11+10000","v":200000},{"$f":"B13+0.0004","v":0.10899999999999986},{"$f":"C13+0.0003","v":9.499999999999989E-2},{"$f":"D13+0.0003","v":8.5000000000000575E-2},7.4000000000000427E-2]
[{"$f":"A12+10000","v":210000},0.10859999999999986,{"$f":"C14+0.0003","v":9.4699999999999895E-2},{"$f":"D14+0.0003","v":8.470000000000058E-2},7.3600000000000429E-2]
[{"$f":"A13+10000","v":220000},0.10819999999999987,{"$f":"C15+0.0003","v":9.4399999999999901E-2},8.4400000000000586E-2,7.3200000000000431E-2]
[230000,0.10779999999999987,9.4099999999999906E-2,8.4100000000000591E-2,7.2800000000000434E-2]
[240000,0.10739999999999987,9.3799999999999911E-2,8.3800000000000596E-2,7.2400000000000436E-2]
[250000,0.10699999999999987,9.3499999999999917E-2,8.3500000000000602E-2,7.2000000000000439E-2]
[{"$f":"A17+10000","v":260000},0.10659999999999988,9.3199999999999922E-2,8.3200000000000607E-2,7.1600000000000441E-2]
[{"$f":"A18+10000","v":270000},0.10619999999999988,9.2899999999999927E-2,8.2900000000000612E-2,7.1200000000000443E-2]
[280000,0.10579999999999988,9.2599999999999932E-2,8.2600000000000617E-2,7.0800000000000446E-2]
{"$rows_left_out":790}
{"sheet":"Phase 2","index":3,"n_rows":30,"n_cols":5,"rows_kept":30,"cut":false,"hidden":false,"merged":[[27,0,27,2],[28,0,28,2],[29,0,29,2],[8,0,8,1],[22,0,22,2],[23,0,23,2],[24,0,24,2],[25,0,25,2],[26,0,26,2],[7,0,7,1],[0,0,0,2],[2,1,2,2],[3,1,3,2],[5,0,5,1],[6,0,6,1]]}
[{"$f":"'Phase 1'!A1:C1","v":"State of New Mexico ARCHITECT RATE SCHEDULE CALCULATION SHEET"}]
["1.5.18 NMAC",null,{"$f":"'Phase 1'!C2","v":"Created 6/12/2017"}]
["Project:",{"$f":"'Phase 1'!B3","v":" "}]
["Location:",{"$f":"'Phase 1'!B4","v":" "}]
["Date:",{"$f":"TODAY()","v":"2017-06-12"}]
["Maximum Allowable Construction Cost (MACC) =",null,{"$f":"'Phase 1'!C6","v":0}]
["Building Type Group (A, B, C, D) = ",null,{"$f":"'Phase 1'!C7","v":"Select"},{"$f":"IF(C7=\" \",0,IF(C7=\"A\",2,IF(C7=\"b\",3,IF(C7=\"c\",4,IF(C7=\"d\",5,0)))))","v":0}]
["Basic Services Fee as a Percentage of MACC =",null,{"$f":"'Phase 1'!C8","v":0}]
["Maximum Architect Rate (MAR) =",null,{"$f":"'Phase 1'!C9","v":0}]
[0,"= New Mexico Gross Receipts Tax Rate",{"$f":"C9*(1+A10)","v":0}]
["Percent of Basic Fee","Design & Construction Phases","Lump Sum (without NMGRT)"]
["N/A",{"$f":"'Phase 1'!B12","v":"Programming Effort ="},{"$f":"IF('Phase 1'!A$19=1,\"N/A\",IF(A12=\"N/A\",\"Previous Phase\",IF(A12>0,C$9*A12,0)))","v":"Previous Phase"}]
[{"$f":"IF('Phase 1'!A$19=1,\"N/A\",IF('Phase 1'!A13>0,\"N/A\",0))","v":0},{"$f":"'Phase 1'!B13","v":"Schematic Design Effort ="},{"$f":"IF('Phase 1'!A$19=1,\"N/A\",IF(A13=\"N/A\",\"Previous Phase\",IF(A13>0,C$9*A13,0)))","v":0}]
[{"$f":"IF('Phase 1'!A$19=1,\"N/A\",IF('Phase 1'!A14>0,\"N/A\",0))","v":0},{"$f":"'Phase 1'!B14","v":"Design Development Effort ="},{"$f":"IF('Phase 1'!A$19=1,\"N/A\",IF(A14=\"N/A\",\"Previous Phase\",IF(A14>0,C$9*A14,0)))","v":0}]
[{"$f":"IF('Phase 1'!A$19=1,\"N/A\",IF('Phase 1'!A15>0,\"N/A\",0))","v":0},{"$f":"'Phase 1'!B15","v":"Construction Documents Effort ="},{"$f":"IF('Phase 1'!A$19=1,\"N/A\",IF(A15=\"N/A\",\"Previous Phase\",IF(A15>0,C$9*A15,0)))","v":0}]
[{"$f":"IF('Phase 1'!A$19=1,\"N/A\",IF('Phase 1'!A16>0,\"N/A\",0))","v":0},{"$f":"'Phase 1'!B16","v":"Award of Contract Effort ="},{"$f":"IF('Phase 1'!A$19=1,\"N/A\",IF(A16=\"N/A\",\"Previous Phase\",IF(A16>0,C$9*A16,0)))","v":0}]
[{"$f":"IF('Phase 1'!A$19=1,\"N/A\",IF('Phase 1'!A17>0,\"N/A\",0))","v":0},{"$f":"'Phase 1'!B17","v":"Construction Effort ="},{"$f":"IF('Phase 1'!A$19=1,\"N/A\",IF(A17=\"N/A\",\"Previous Phase\",IF(A17>0,C$9*A17,0)))","v":0}]
[{"$f":"IF('Phase 1'!A$19=1,\"N/A\",IF('Phase 1'!A18>0,\"N/A\",0))","v":0},{"$f":"'Phase 1'!B18","v":"Closeout Effort ="},{"$f":"IF('Phase 1'!A$19=1,\"N/A\",IF(A18=\"N/A\",\"Previous Phase\",IF(A18>0,C$9*A18,0)))","v":0}]
[{"$f":"SUM(A12:A18)","v":0},"PHASE TWO TOTAL =",{"$f":"IF(A19>1,\"ERROR\",SUM(C12:C18))","v":0},null,{"$f":"IF(A19>1,\"= Value exceeds MAR value in Cell C9\",\" \")","v":" "}]
[{"$f":"'Phase 1'!A19","v":0},"PHASE ONE TOTAL =",{"$f":"'Phase 1'!C19","v":0}]
{"$rows_left_out":11}
{"sheet":"Phase 3","index":4,"n_rows":30,"n_cols":5,"rows_kept":30,"cut":false,"hidden":false,"merged":[[7,0,7,1],[0,0,0,2],[2,1,2,2],[3,1,3,2],[5,0,5,1],[6,0,6,1],[27,0,27,2],[28,0,28,2],[29,0,29,2],[8,0,8,1],[22,0,22,2],[23,0,23,2],[24,0,24,2],[25,0,25,2],[26,0,26,2]]}
[{"$f":"'Phase 1'!A1:C1","v":"State of New Mexico ARCHITECT RATE SCHEDULE CALCULATION SHEET"}]
["1.5.18 NMAC",null,{"$f":"'Phase 1'!C2","v":"Created 6/12/2017"}]
["Project:",{"$f":"'Phase 1'!B3","v":" "}]
["Location:",{"$f":"'Phase 1'!B4","v":" "}]
["Date:",{"$f":"TODAY()","v":"2017-06-12"}]
["Maximum Allowable Construction Cost (MACC) =",null,{"$f":"'Phase 1'!C6","v":0}]
["Building Type Group (A, B, C, D) = ",null,{"$f":"'Phase 1'!C7","v":"Select"},{"$f":"IF(C7=\" \",0,IF(C7=\"A\",2,IF(C7=\"b\",3,IF(C7=\"c\",4,IF(C7=\"d\",5,0)))))","v":0}]
["Basic Services Fee as a Percentage of MACC =",null,{"$f":"'Phase 1'!C8","v":0}]
["Maximum Architect Rate (MAR) =",null,{"$f":"IF(C8=\"Negotiable\",\"Negotiable\",C6*C8)","v":0}]
[0,"= New Mexico Gross Receipts Tax Rate",{"$f":"IF(C8=\"Negotiable\",\"N/A\",C9*(1+A10))","v":0}]
["Percent of Basic Fee","Design & Construction Phases","Lump Sum (without NMGRT)"]
["N/A",{"$f":"'Phase 1'!B12","v":"Programming Effort ="},{"$f":"IF('Phase 1'!A$19=1,\"N/A\",IF('Phase 2'!A$21=1,\"N/A\",IF(A12=\"N/A\",\"Previous Phase\",IF(A12>0,C$9*A12,0))))","v":"Previous Phase"}]
["N/A",{"$f":"'Phase 1'!B13","v":"Schematic Design Effort ="},{"$f":"IF('Phase 1'!A$19=1,\"N/A\",IF('Phase 2'!A$21=1,\"N/A\",IF(A13=\"N/A\",\"Previous Phase\",IF(A13>0,C$9*A13,0))))","v":"Previous Phase"}]
[{"$f":"IF('Phase 1'!A$19=1,\"N/A\",IF('Phase 2'!A$19=1,\"N/A\",IF('Phase 2'!A14>0,\"N/A\",0)))","v":0},{"$f":"'Phase 1'!B14","v":"Design Development Effort ="},{"$f":"IF('Phase 1'!A$19=1,\"N/A\",IF('Phase 2'!A$21=1,\"N/A\",IF(A14=\"N/A\",\"Previous Phase\",IF(A14>0,C$9*A14,0))))","v":0}]
[{"$f":"IF('Phase 1'!A$19=1,\"N/A\",IF('Phase 2'!A$19=1,\"N/A\",IF('Phase 2'!A15>0,\"N/A\",0)))","v":0},{"$f":"'Phase 1'!B15","v":"Construction Documents Effort ="},{"$f":"IF('Phase 1'!A$19=1,\"N/A\",IF('Phase 2'!A$21=1,\"N/A\",IF(A15=\"N/A\",\"Previous Phase\",IF(A15>0,C$9*A15,0))))","v":0}]
[{"$f":"IF('Phase 1'!A$19=1,\"N/A\",IF('Phase 2'!A$19=1,\"N/A\",IF('Phase 2'!A16>0,\"N/A\",0)))","v":0},{"$f":"'Phase 1'!B16","v":"Award of Contract Effort ="},{"$f":"IF('Phase 1'!A$19=1,\"N/A\",IF('Phase 2'!A$21=1,\"N/A\",IF(A16=\"N/A\",\"Previous Phase\",IF(A16>0,C$9*A16,0))))","v":0}]
[{"$f":"IF('Phase 1'!A$19=1,\"N/A\",IF('Phase 2'!A$19=1,\"N/A\",IF('Phase 2'!A17>0,\"N/A\",0)))","v":0},{"$f":"'Phase 1'!B17","v":"Construction Effort ="},{"$f":"IF('Phase 1'!A$19=1,\"N/A\",IF('Phase 2'!A$21=1,\"N/A\",IF(A17=\"N/A\",\"Previous Phase\",IF(A17>0,C$9*A17,0))))","v":0}]
[{"$f":"IF('Phase 1'!A$19=1,\"N/A\",IF('Phase 2'!A$19=1,\"N/A\",IF('Phase 2'!A18>0,\"N/A\",0)))","v":0},{"$f":"'Phase 1'!B18","v":"Closeout Effort ="},{"$f":"IF('Phase 1'!A$19=1,\"N/A\",IF('Phase 2'!A$21=1,\"N/A\",IF(A18=\"N/A\",\"Previous Phase\",IF(A18>0,C$9*A18,0))))","v":0}]
[{"$f":"SUM(A12:A18)","v":0}," PHASE THREE TOTAL =",{"$f":"IF(A19>1,\"ERROR\",SUM(C12:C18))","v":0},null,{"$f":"IF(A19>1,\"= Value exceeds MAR value in Cell C9\",\" \")","v":" "}]
[{"$f":"'Phase 2'!A21","v":0},"PHASE ONE & TWO TOTAL =",{"$f":"'Phase 2'!C21","v":0}]
{"$rows_left_out":10}