{"text_format":"1","workbook":"xlsx","n_sheets":5,"sheets":["Instructions","Phase 1","TABLE","Phase 2","Phase 3"],"not_rendered":{"charts":0,"images":1,"macros":1,"external_links":0,"defined_names":5,"comments":0,"pivot_tables":0},"unopened":[],"bounds":{"document_bytes":16777216,"sheet_cells":100000,"rows_first":2000,"rows_last":500,"rows_between":2000,"halvings":0,"cell_chars":16384,"cell_head_chars":4096},"cells_cut":0,"cells_raw":0,"read":"whole","date_system":"1900"}

{"sheet":"Instructions","index":0,"n_rows":24,"n_cols":2,"rows_kept":24,"cut":false,"hidden":false,"merged":[[1,0,1,1],[5,0,5,1],[0,0,0,1],[2,0,2,1],[4,0,4,1],[3,0,3,1]]}
[" State of New Mexico ARCHITECT RATE SCHEDULE CALCULATION SHEET NOTES"]
["THIS FILE MAY BE USED FOR SINGLE OR MULTI-PHASED DESIGN CALCULATIONS"]
["MAR = Maximum Allowable Rate"]
["NMGRT - New Mexico Gross Receipts Tax"]
["MACC = Maximum Allowable Construction Cost"]
["Note: The NM Architectural Rate Schedule only applies to MACC values between $150k and $10M.  This file provides calculations with MACC values between $100k to $30M.  When MACC values go outside the published range, the header will change to clarify that the calculations are BASED on the NM Rate Schedule."]
["In PHASE ONE tab:"]
[1,"Enter the Project Name and the Location in cells B3 and B4"]
[2,"Enter the MACC value in cell C6"]
[3,"Enter the Building Type in cell C7 (A, B, C, or D following guideline notes starting in Row 21)"]
[4,"Enter the applicable A&E office location NMGRT value in cell A10"]
[5,"In cells A12 through B18, enter the applicable project-specific efforts and percentages."]
["In PHASE TWO tab:"]
[null,"Project Name, Location, MACC, and Building Type must be completed in the Phase One tab"]
[6,"Enter the applicable A&E office location NMGRT value in cell A10"]
[7,"In cells A13 through B18, enter the applicable project-specific phases and percentages."]
[null,"If necessary, use the RESET FORMULAS macro to erase entries and start over for this tab only."]
["In PHASE THREE tab:"]
[null,"Project Name, Location, MACC, and Building Type must be completed in the Phase One tab"]
[8,"Enter the applicable A&E office location NMGRT value in cell A10"]
[9,"In cells A14 through B18, enter the applicable project-specific phases and percentages."]
[null,"If necessary, use the RESET FORMULAS macro to erase entries and start over for this tab only."]
["Printing:"]
[null,"Print ranges are pre-set for the Phase 1, 2, & 3 tabs"]

{"sheet":"Phase 1","index":1,"n_rows":28,"n_cols":6,"rows_kept":28,"cut":false,"hidden":false,"merged":[[0,0,0,2],[20,0,20,2],[26,0,26,2],[2,1,2,2],[3,1,3,2],[27,0,27,2],[5,0,5,1],[6,0,6,1],[7,0,7,1],[8,0,8,1],[21,0,21,2],[22,0,22,2],[23,0,23,2],[24,0,24,2],[25,0,25,2]]}
[{"$f":"IF(OR(C6=0,C6<100000),\"State of New Mexico ARCHITECT RATE SCHEDULE CALCULATION SHEET\",IF(OR(C6<150000,C6>10000000),\"Based on State of NM ARCHITECT RATE SCHEDULE CALCULATION SHEET\",\"State of New Mexico ARCHITECT RATE SCHEDULE CALCULATION SHEET\"))","v":"State of New Mexico ARCHITECT RATE SCHEDULE CALCULATION SHEET"}]
["1.5.18 NMAC",null,"Created 6/12/2017"]
["Project:"," "]
["Location:"," "]
["Date:",{"$f":"TODAY()","v":"2017-06-12"}]
["Maximum Allowable Construction Cost (MACC) =",null,0,null,null,{"$f":"IF(C6<100000,\"MACC RANGE MUST BE BETWEEN $100K AND $30M\",IF(C6>30000000,\"MACC RANGE MUST BE BETWEEN $100K AND $30M\",\" \"))","v":"MACC RANGE MUST BE BETWEEN $100K AND $30M"}]
["Building Type Group (A, B, C, D) = ",null,"Select",{"$f":"IF(C7=\" \",0,IF(C7=\"A\",2,IF(C7=\"b\",3,IF(C7=\"c\",4,IF(C7=\"d\",5,0)))))","v":0},"Select"]
["Basic Services Fee as a Percentage of MACC =",null,{"$f":"IF(C7=\"Select\",0,VLOOKUP(C6,TABLE!A1:E809,D7))","v":0},null,"A"]
["Maximum Architect Rate (MAR) =",null,{"$f":"C6*C8","v":0},null,"B"]
[0,"= New Mexico Gross Receipts Tax Rate",{"$f":"C9*(1+A10)","v":0},null,"C"]
["Percent of Basic Fee","Design & Construction Phases","Lump Sum (without NMGRT)",null,"D"]
[0,"Programming Effort =",{"$f":"IF(C9=\"Negotiable\",\"Negotiable\",C9*A12)","v":0}]
[0,"Schematic Design Effort =",{"$f":"IF(C9=\"Negotiable\",\"Negotiable\",C9*A13)","v":0}]
[0,"Design Development Effort =",{"$f":"IF(C9=\"Negotiable\",\"Negotiable\",C9*A14)","v":0}]
[0,"Construction Documents Effort =",{"$f":"IF(C9=\"Negotiable\",\"Negotiable\",C9*A15)","v":0}]
[0,"Award of Contract Effort =",{"$f":"IF(C9=\"Negotiable\",\"Negotiable\",C9*A16)","v":0}]
[0,"Construction Effort =",{"$f":"IF(C9=\"Negotiable\",\"Negotiable\",C9*A17)","v":0}]
[0,"Closeout Effort =",{"$f":"IF(C9=\"Negotiable\",\"Negotiable\",C9*A18)","v":0}]
[{"$f":"SUM(A12:A18)","v":0},{"$f":"IF(A19=1,\"TOTAL =\",\"PHASE ONE TOTAL =\")","v":"PHASE ONE TOTAL ="},{"$f":"IF(A19>1,\"ERROR\",SUM(C12:C18))","v":0},null,null,{"$f":"IF(A19>1,\"= Value exceeds MAR value in Cell C9\",\" \")","v":" "}]
[]
["Building Types (1.5.18.9 A. NMAC)"]
["A - Specialized projects - Broadcast and telecast facility, concert hall, data processing center, detention facility, emergency operating center, fish hatchery and rearing facility, hospital, laboratory, museum, research facility."]
["B - Complex projects - Animal control facility, auditorium, church, clinic, convention center, court house, educational building (with special facilities such as trade, vocation, etc.), fitness center, laundry, library, medical center, mortuary, parking structure (enclosed), repair garage, residence (custom), restaurant, swimming pool (enclosed) synagogue, theater, transportation terminal, zoo facility."]
["C - Average projects - Apartment building, armory, bakery, bank, cafeteria, chapel, community center, dormitory, educational building (without special facilities), fire station, gymnasium, hotel, industrial building, motel, office building, parking structure (open air), police administration building, recreational building, retail store."]
["D - Simple projects - Airplane hangar, barn, comfort station, garage (without repair work), residence, stadium (open air), swimming pool (open air), warehouse."]
["General notes (1.5.18.9 B. NMAC):\n(1)     Rates for building types not listed in the building type group schedule should be negotiated from the rates indicated for buildings of similar design complexity. In instances where the owner of user has no similar facility and is not able to offer any guidance or expertise to the building to be constructed, the architect rate shall be negotiated with the architect rate schedule chart, Appendix A, only as a reference, whenever applicable.\n(2)     When a building or project includes several types of uses, the schedule rates apply to such types individually and negotiation is appropriate.\n(3)    Alterations to buildings may involve many unforeseeable conditions that may not easily be included in normal basic services. An alteration is defined as any change, architectural, structural, mechanical, or electrical, made to an existing building, and includes portions of buildings altered as a result of a new wing extension of such building, excluding historical restorations. Negotiation of the architect's rate for alterations in all categories is appropriate. Consideration of whether there are \"trade-offs\" in the scope of services should be taken.\n(4)     Historical renovation projects as a general rule require services substantially in excess of those cited as basic services. These services can include investigative analysis of existing systems, demolition planning and coordination, historical data collection and other coordination. Other instances may not address serious modification of structural systems, finishes, etc. Negotiation of the architect rates is appropriate for all categories of building types whenever the primary architectural services are for historic building renovation."]
["(5)    Where multi-contract of fast-track construction contracts are deemed to be in the best interest of the state and are required in writing by the state, negotiation of the fee is appropriate. Multi-contract or fast-track projects as a general rule require higher levels of coordination, additional personnel, increased levels of construction observation, and accelerated time schedules, all of which may increase the costs of architectural activities.\n(6)     On projects not requiring full basic services (such as fixtures, equipment, furnishings, interior displays, memorials, reroofing, etc.), when not a part of an overall building, the architect rate shall be negotiated on a cost-based compensation basis by individual project.\n(7)     For projects whose major design elements are repetitive, the architect rates in all categories may be reduced to reflect the repetitive nature of the project.\n(8)     \"Residence,\" as used in building type group D, is defined as a development-type residence, namely, a single- or two-family house.\n(9)     Fees for projects under $150,000 and over $10,000,000 shall be negotiated individually on a cost-based compensation basis; this rate schedule shall not apply.\n\n"]
["http://164.64.110.239/nmac/parts/title01/01.005.0018.htm"]

{"sheet":"TABLE","index":2,"n_rows":809,"n_cols":7,"rows_kept":809,"cut":false,"hidden":true,"merged":[]}
[null,"A","B","C","D"]
[100000,0.115,0.10100000000000001,0.09,0.08]
[{"$f":"A2+10000","v":110000},{"$f":"B4+0.0006","v":0.11439999999999989},{"$f":"C4+0.0006","v":0.10039999999999992},{"$f":"D4+0.0004","v":8.9600000000000582E-2},{"$f":"E4+0.0006","v":7.9400000000000456E-2},null,1]
[{"$f":"A3+10000","v":120000},{"$f":"B5+0.0006","v":0.11379999999999989},9.9799999999999917E-2,{"$f":"D5+0.0004","v":8.9200000000000584E-2},7.8800000000000453E-2,null,2]
[130000,{"$f":"B6+0.0006","v":0.11319999999999988},9.9199999999999913E-2,{"$f":"D6+0.0004","v":8.8800000000000587E-2},7.820000000000045E-2,null,3]
[140000,{"$f":"B7+0.0006","v":0.11259999999999988},9.859999999999991E-2,{"$f":"D7+0.0004","v":8.8400000000000589E-2},7.7600000000000446E-2,null,4]
[150000,{"$f":"B8+0.0006","v":0.11199999999999988},9.7999999999999907E-2,{"$f":"D8+0.0006","v":8.8000000000000592E-2},7.7000000000000443E-2,null,5]
[160000,{"$f":"B9+0.0006","v":0.11139999999999987},9.7399999999999903E-2,8.7400000000000588E-2,7.640000000000044E-2,null,6]
[170000,{"$f":"B10+0.0006","v":0.11079999999999987},9.67999999999999E-2,8.6800000000000585E-2,7.5800000000000436E-2,null,7]
[{"$f":"A9+10000","v":180000},{"$f":"B11+0.0006","v":0.11019999999999987},9.6199999999999897E-2,8.6200000000000582E-2,7.5200000000000433E-2,null,8]
[190000,{"$f":"B12+0.0006","v":0.10959999999999986},9.5599999999999893E-2,8.5600000000000578E-2,7.460000000000043E-2,null,10]
[{"$f":"A11+10000","v":200000},{"$f":"B13+0.0004","v":0.10899999999999986},{"$f":"C13+0.0003","v":9.499999999999989E-2},{"$f":"D13+0.0003","v":8.5000000000000575E-2},7.4000000000000427E-2]
[{"$f":"A12+10000","v":210000},0.10859999999999986,{"$f":"C14+0.0003","v":9.4699999999999895E-2},{"$f":"D14+0.0003","v":8.470000000000058E-2},7.3600000000000429E-2]
[{"$f":"A13+10000","v":220000},0.10819999999999987,{"$f":"C15+0.0003","v":9.4399999999999901E-2},8.4400000000000586E-2,7.3200000000000431E-2]
[230000,0.10779999999999987,9.4099999999999906E-2,8.4100000000000591E-2,7.2800000000000434E-2]
[240000,0.10739999999999987,9.3799999999999911E-2,8.3800000000000596E-2,7.2400000000000436E-2]
[250000,0.10699999999999987,9.3499999999999917E-2,8.3500000000000602E-2,7.2000000000000439E-2]
[{"$f":"A17+10000","v":260000},0.10659999999999988,9.3199999999999922E-2,8.3200000000000607E-2,7.1600000000000441E-2]
[{"$f":"A18+10000","v":270000},0.10619999999999988,9.2899999999999927E-2,8.2900000000000612E-2,7.1200000000000443E-2]
[280000,0.10579999999999988,9.2599999999999932E-2,8.2600000000000617E-2,7.0800000000000446E-2]
[290000,{"$f":"B22+0.0004","v":0.10539999999999988},9.2299999999999938E-2,8.2300000000000623E-2,{"$f":"E22+0.0004","v":7.0400000000000448E-2}]
[300000,{"$f":"B23+0.0002","v":0.10499999999999989},9.1999999999999943E-2,8.2000000000000628E-2,7.0000000000000451E-2]
[{"$f":"A22+10000","v":310000},{"$f":"B24+0.0002","v":0.10479999999999988},{"$f":"C24+0.0002","v":9.1799999999999937E-2},{"$f":"D24+0.0002","v":8.1800000000000622E-2},{"$f":"E24+0.0002","v":6.9800000000000445E-2}]
[{"$f":"A23+10000","v":320000},{"$f":"B25+0.0002","v":0.10459999999999987},9.1599999999999931E-2,8.1600000000000616E-2,6.9600000000000439E-2]
[330000,0.10439999999999987,9.1399999999999926E-2,8.1400000000000611E-2,6.9400000000000434E-2]
[340000,0.10419999999999986,9.119999999999992E-2,8.1200000000000605E-2,6.9200000000000428E-2]
[350000,0.10399999999999986,9.0999999999999914E-2,8.1000000000000599E-2,6.9000000000000422E-2]
[{"$f":"A27+10000","v":360000},0.10379999999999985,9.0799999999999909E-2,8.0800000000000594E-2,6.8800000000000416E-2]
[{"$f":"A28+10000","v":370000},0.10359999999999984,9.0599999999999903E-2,8.0600000000000588E-2,6.8600000000000411E-2]
[380000,0.10339999999999984,9.0399999999999897E-2,8.0400000000000582E-2,6.8400000000000405E-2]
[390000,0.10319999999999983,9.0199999999999891E-2,8.0200000000000576E-2,6.8200000000000399E-2]
[400000,{"$f":"B33+0.0002","v":0.10299999999999983},8.9999999999999886E-2,8.0000000000000571E-2,6.8000000000000393E-2]
[{"$f":"A32+10000","v":410000},{"$f":"B34+0.0002","v":0.10279999999999982},{"$f":"C34+0.0002","v":8.979999999999988E-2},{"$f":"D34+0.0002","v":7.9800000000000565E-2},{"$f":"E34+0.0002","v":6.7800000000000388E-2}]
[{"$f":"A33+10000","v":420000},0.10259999999999982,8.9599999999999874E-2,7.9600000000000559E-2,6.7600000000000382E-2]
[430000,0.10239999999999981,8.9399999999999868E-2,7.9400000000000553E-2,6.7400000000000376E-2]
[440000,0.1021999999999998,8.9199999999999863E-2,7.9200000000000548E-2,6.7200000000000371E-2]
[450000,0.1019999999999998,8.8999999999999857E-2,7.9000000000000542E-2,6.7000000000000365E-2]
[{"$f":"A37+10000","v":460000},0.10179999999999979,8.8799999999999851E-2,7.8800000000000536E-2,6.6800000000000359E-2]
[{"$f":"A38+10000","v":470000},0.10159999999999979,8.8599999999999846E-2,7.8600000000000531E-2,6.6600000000000353E-2]
[480000,0.10139999999999978,8.839999999999984E-2,7.8400000000000525E-2,6.6400000000000348E-2]
[490000,0.10119999999999978,8.8199999999999834E-2,7.8200000000000519E-2,6.6200000000000342E-2]
[500000,{"$f":"B43+0.0001","v":0.10099999999999977},8.7999999999999828E-2,7.8000000000000513E-2,6.6000000000000336E-2]
[{"$f":"A42+10000","v":510000},0.10089999999999977,8.7899999999999825E-2,7.7900000000000511E-2,6.5900000000000333E-2]
[{"$f":"A43+10000","v":520000},0.10079999999999976,8.7799999999999823E-2,7.7800000000000508E-2,6.580000000000033E-2]
[530000,0.10069999999999976,8.769999999999982E-2,7.7700000000000505E-2,6.5700000000000328E-2]
[540000,0.10059999999999976,8.7599999999999817E-2,7.7600000000000502E-2,6.5600000000000325E-2]
[550000,0.10049999999999976,8.7499999999999814E-2,7.7500000000000499E-2,6.5500000000000322E-2]
[{"$f":"A47+10000","v":560000},0.10039999999999975,8.7399999999999811E-2,7.7400000000000496E-2,6.5400000000000319E-2]
[{"$f":"A48+10000","v":570000},0.10029999999999975,8.7299999999999808E-2,7.7300000000000493E-2,6.5300000000000316E-2]
[580000,0.10019999999999975,8.7199999999999805E-2,7.720000000000049E-2,6.5200000000000313E-2]
[590000,{"$f":"B52+0.0001","v":0.10009999999999974},{"$f":"C52+0.0001","v":8.7099999999999803E-2},{"$f":"D52+0.0001","v":7.7100000000000488E-2},{"$f":"E52+0.0001","v":6.510000000000031E-2}]
[600000,{"$f":"B53+0.00015","v":9.9999999999999742E-2},{"$f":"C53+0.0001","v":8.69999999999998E-2},{"$f":"D53+0.0001","v":7.7000000000000485E-2},6.5000000000000308E-2]
[{"$f":"A52+10000","v":610000},9.9849999999999745E-2,{"$f":"C54+0.0001","v":8.6899999999999797E-2},7.6900000000000482E-2,6.485000000000031E-2]
[{"$f":"A53+10000","v":620000},9.9699999999999747E-2,8.6799999999999794E-2,7.6800000000000479E-2,6.4700000000000313E-2]
[630000,9.954999999999975E-2,8.6699999999999791E-2,7.6700000000000476E-2,6.4550000000000315E-2]
[640000,9.9399999999999752E-2,8.6599999999999788E-2,7.6600000000000473E-2,6.4400000000000318E-2]
[650000,9.9249999999999755E-2,8.6499999999999785E-2,7.650000000000047E-2,6.4250000000000321E-2]
[{"$f":"A57+10000","v":660000},9.9099999999999758E-2,8.6399999999999783E-2,7.6400000000000468E-2,6.4100000000000323E-2]
[{"$f":"A58+10000","v":670000},9.894999999999976E-2,8.629999999999978E-2,7.6300000000000465E-2,6.3950000000000326E-2]
[680000,9.8799999999999763E-2,8.6199999999999777E-2,7.6200000000000462E-2,6.3800000000000329E-2]
[690000,9.8649999999999766E-2,8.6099999999999774E-2,7.6100000000000459E-2,6.3650000000000331E-2]
[700000,9.8499999999999768E-2,{"$f":"C63+0.0001","v":8.5999999999999771E-2},{"$f":"D63+0.0001","v":7.6000000000000456E-2},6.3500000000000334E-2]
[{"$f":"A62+10000","v":710000},{"$f":"B64+0.00015","v":9.8349999999999771E-2},{"$f":"C64+0.0001","v":8.5899999999999768E-2},7.5900000000000453E-2,6.3350000000000337E-2]
[{"$f":"A63+10000","v":720000},9.8199999999999774E-2,8.5799999999999765E-2,7.580000000000045E-2,6.3200000000000339E-2]
[730000,9.8049999999999776E-2,8.5699999999999762E-2,7.5700000000000447E-2,6.3050000000000342E-2]
[740000,9.7899999999999779E-2,8.559999999999976E-2,7.5600000000000445E-2,6.2900000000000345E-2]
[750000,9.7749999999999782E-2,8.5499999999999757E-2,7.5500000000000442E-2,6.2750000000000347E-2]
[{"$f":"A67+10000","v":760000},9.7599999999999784E-2,8.5399999999999754E-2,7.5400000000000439E-2,6.260000000000035E-2]
[{"$f":"A68+10000","v":770000},9.7449999999999787E-2,8.5299999999999751E-2,7.5300000000000436E-2,6.2450000000000346E-2]
[780000,9.7299999999999789E-2,8.5199999999999748E-2,7.5200000000000433E-2,6.2300000000000348E-2]
[790000,{"$f":"B72+0.00015","v":9.7149999999999792E-2},8.5099999999999745E-2,7.510000000000043E-2,{"$f":"E72+0.00015","v":6.2150000000000351E-2}]
[800000,{"$f":"B73+0.0001","v":9.6999999999999795E-2},8.4999999999999742E-2,7.5000000000000427E-2,6.2000000000000353E-2]
[{"$f":"A72+10000","v":810000},9.6899999999999792E-2,8.489999999999974E-2,7.4900000000000425E-2,6.1900000000000351E-2]
[{"$f":"A73+10000","v":820000},9.6799999999999789E-2,8.4799999999999737E-2,7.4800000000000422E-2,6.1800000000000348E-2]
[830000,9.6699999999999786E-2,8.4699999999999734E-2,7.4700000000000419E-2,6.1700000000000345E-2]
[840000,9.6599999999999783E-2,8.4599999999999731E-2,7.4600000000000416E-2,6.1600000000000342E-2]
[850000,9.649999999999978E-2,8.4499999999999728E-2,7.4500000000000413E-2,6.1500000000000339E-2]
[{"$f":"A77+10000","v":860000},9.6399999999999778E-2,8.4399999999999725E-2,7.440000000000041E-2,6.1400000000000336E-2]
[{"$f":"A78+10000","v":870000},9.6299999999999775E-2,8.4299999999999722E-2,7.4300000000000407E-2,6.1300000000000333E-2]
[880000,9.6199999999999772E-2,8.419999999999972E-2,7.4200000000000405E-2,6.1200000000000331E-2]
[890000,{"$f":"B82+0.0001","v":9.6099999999999769E-2},{"$f":"C82+0.0001","v":8.4099999999999717E-2},{"$f":"D82+0.0001","v":7.4100000000000402E-2},{"$f":"E82+0.0001","v":6.1100000000000328E-2}]
[900000,{"$f":"B83+0.0001","v":9.5999999999999766E-2},8.3999999999999714E-2,7.4000000000000399E-2,6.1000000000000325E-2]
[{"$f":"A82+10000","v":910000},9.5899999999999763E-2,8.3899999999999711E-2,7.3900000000000396E-2,6.0900000000000322E-2]
[{"$f":"A83+10000","v":920000},9.579999999999976E-2,8.3799999999999708E-2,7.3800000000000393E-2,6.0800000000000319E-2]
[930000,9.5699999999999757E-2,8.3699999999999705E-2,7.370000000000039E-2,6.0700000000000316E-2]
[940000,9.5599999999999755E-2,8.3599999999999702E-2,7.3600000000000387E-2,6.0600000000000313E-2]
[950000,9.5499999999999752E-2,8.3499999999999699E-2,7.3500000000000384E-2,6.050000000000031E-2]
[{"$f":"A87+10000","v":960000},9.5399999999999749E-2,8.3399999999999697E-2,7.3400000000000382E-2,6.0400000000000308E-2]
[{"$f":"A88+10000","v":970000},9.5299999999999746E-2,8.3299999999999694E-2,7.3300000000000379E-2,6.0300000000000305E-2]
[980000,9.5199999999999743E-2,8.3199999999999691E-2,7.3200000000000376E-2,6.0200000000000302E-2]
[990000,{"$f":"B92+0.0001","v":9.509999999999974E-2},{"$f":"C92+0.0001","v":8.3099999999999688E-2},{"$f":"D92+0.0001","v":7.3100000000000373E-2},{"$f":"E92+0.0001","v":6.0100000000000299E-2}]
[1000000,{"$f":"B93+0.0003","v":9.4999999999999737E-2},{"$f":"C93+0.00025","v":8.2999999999999685E-2},7.300000000000037E-2,6.0000000000000296E-2]
[{"$f":"A92+50000","v":1050000},9.4699999999999743E-2,8.2749999999999685E-2,7.275000000000037E-2,5.9700000000000294E-2]
[1100000,9.4399999999999748E-2,8.2499999999999685E-2,7.250000000000037E-2,5.9400000000000293E-2]
[1150000,9.4099999999999753E-2,8.2249999999999684E-2,7.2250000000000369E-2,5.9100000000000291E-2]
[1200000,9.3799999999999759E-2,8.1999999999999684E-2,7.2000000000000369E-2,5.880000000000029E-2]
[1250000,9.3499999999999764E-2,8.1749999999999684E-2,7.1750000000000369E-2,5.8500000000000288E-2]
[1300000,9.3199999999999769E-2,8.1499999999999684E-2,7.1500000000000369E-2,5.8200000000000286E-2]
[1350000,9.2899999999999774E-2,8.1249999999999684E-2,7.1250000000000369E-2,5.7900000000000285E-2]
[1400000,9.259999999999978E-2,8.0999999999999683E-2,7.1000000000000368E-2,5.7600000000000283E-2]
[1450000,{"$f":"B102+0.0003","v":9.2299999999999785E-2},8.0749999999999683E-2,7.0750000000000368E-2,{"$f":"E102+0.0003","v":5.7300000000000281E-2}]
[1500000,{"$f":"B103+0.0003","v":9.199999999999979E-2},8.0499999999999683E-2,7.0500000000000368E-2,5.700000000000028E-2]
[1550000,9.1699999999999796E-2,8.0249999999999683E-2,7.0250000000000368E-2,5.6700000000000278E-2]
[1600000,9.1399999999999801E-2,7.9999999999999682E-2,7.0000000000000367E-2,5.6400000000000276E-2]
[1650000,9.1099999999999806E-2,7.9749999999999682E-2,6.9750000000000367E-2,5.6100000000000275E-2]
[1700000,9.0799999999999811E-2,7.9499999999999682E-2,6.9500000000000367E-2,5.5800000000000273E-2]
[1750000,9.0499999999999817E-2,7.9249999999999682E-2,6.9250000000000367E-2,5.5500000000000271E-2]
[1800000,9.0199999999999822E-2,7.8999999999999682E-2,6.9000000000000367E-2,5.520000000000027E-2]
[1850000,8.9899999999999827E-2,7.8749999999999681E-2,6.8750000000000366E-2,5.4900000000000268E-2]
[1900000,8.9599999999999833E-2,7.8499999999999681E-2,6.8500000000000366E-2,5.4600000000000266E-2]
[1950000,{"$f":"B112+0.0003","v":8.9299999999999838E-2},{"$f":"C112+0.00025","v":7.8249999999999681E-2},{"$f":"D112+0.00025","v":6.8250000000000366E-2},{"$f":"E112+0.0003","v":5.4300000000000265E-2}]
[2000000,{"$f":"B113+0.0002","v":8.8999999999999843E-2},7.7999999999999681E-2,6.8000000000000366E-2,5.4000000000000263E-2]
[2050000,{"$f":"B114+0.0002","v":8.8799999999999837E-2},{"$f":"C114+0.0002","v":7.7799999999999675E-2},{"$f":"D114+0.0002","v":6.780000000000036E-2},{"$f":"E114+0.0002","v":5.3800000000000264E-2}]
[2100000,{"$f":"B115+0.0002","v":8.8599999999999832E-2},7.7599999999999669E-2,6.7600000000000354E-2,5.3600000000000265E-2]
[2150000,8.8399999999999826E-2,7.7399999999999664E-2,6.7400000000000349E-2,5.3400000000000267E-2]
[2200000,8.819999999999982E-2,7.7199999999999658E-2,6.7200000000000343E-2,5.3200000000000268E-2]
[2250000,8.7999999999999814E-2,7.6999999999999652E-2,6.7000000000000337E-2,5.3000000000000269E-2]
[2300000,8.7799999999999809E-2,7.6799999999999646E-2,6.6800000000000331E-2,5.280000000000027E-2]
[2350000,8.7599999999999803E-2,7.6599999999999641E-2,6.6600000000000326E-2,5.2600000000000272E-2]
[2400000,8.7399999999999797E-2,7.6399999999999635E-2,6.640000000000032E-2,5.2400000000000273E-2]
[2450000,8.7199999999999792E-2,7.6199999999999629E-2,6.6200000000000314E-2,5.2200000000000274E-2]
[2500000,{"$f":"B123+0.0002","v":8.6999999999999786E-2},7.5999999999999623E-2,6.6000000000000308E-2,5.2000000000000275E-2]
[2550000,8.679999999999978E-2,7.5799999999999618E-2,6.5800000000000303E-2,5.1800000000000276E-2]
[2600000,8.6599999999999774E-2,7.5599999999999612E-2,6.5600000000000297E-2,5.1600000000000278E-2]
[2650000,8.6399999999999769E-2,7.5399999999999606E-2,6.5400000000000291E-2,5.1400000000000279E-2]
[2700000,8.6199999999999763E-2,7.51999999999996E-2,6.5200000000000286E-2,5.120000000000028E-2]
[2750000,8.5999999999999757E-2,7.4999999999999595E-2,6.500000000000028E-2,5.1000000000000281E-2]
[2800000,8.5799999999999751E-2,7.4799999999999589E-2,6.4800000000000274E-2,5.0800000000000282E-2]
[2850000,8.5599999999999746E-2,7.4599999999999583E-2,6.4600000000000268E-2,5.0600000000000284E-2]
[2900000,8.539999999999974E-2,7.4399999999999578E-2,6.4400000000000263E-2,5.0400000000000285E-2]
[2950000,8.5199999999999734E-2,7.4199999999999572E-2,6.4200000000000257E-2,5.0200000000000286E-2]
[3000000,{"$f":"B133+0.0001","v":8.4999999999999729E-2},7.3999999999999566E-2,6.4000000000000251E-2,5.0000000000000287E-2]
[3050000,{"$f":"B134+0.0001","v":8.4899999999999726E-2},{"$f":"C134+0.0001","v":7.3899999999999563E-2},{"$f":"D134+0.0001","v":6.3900000000000248E-2},{"$f":"E134+0.0001","v":4.9900000000000284E-2}]
[3100000,{"$f":"B135+0.0001","v":8.4799999999999723E-2},7.379999999999956E-2,6.3800000000000245E-2,4.9800000000000282E-2]
[3150000,8.469999999999972E-2,7.3699999999999558E-2,6.3700000000000243E-2,4.9700000000000279E-2]
[3200000,8.4599999999999717E-2,7.3599999999999555E-2,6.360000000000024E-2,4.9600000000000276E-2]
[3250000,8.4499999999999714E-2,7.3499999999999552E-2,6.3500000000000237E-2,4.9500000000000273E-2]
[3300000,8.4399999999999711E-2,7.3399999999999549E-2,6.3400000000000234E-2,4.940000000000027E-2]
[3350000,8.4299999999999708E-2,7.3299999999999546E-2,6.3300000000000231E-2,4.9300000000000267E-2]
[{"$f":"A139+50000","v":3400000},8.4199999999999706E-2,7.3199999999999543E-2,6.3200000000000228E-2,4.9200000000000264E-2]
[3450000,8.4099999999999703E-2,7.309999999999954E-2,6.3100000000000225E-2,4.9100000000000261E-2]
[3500000,8.39999999999997E-2,7.2999999999999537E-2,6.3000000000000222E-2,4.9000000000000259E-2]
[3550000,{"$f":"B144+0.0001","v":8.3899999999999697E-2},7.2899999999999535E-2,6.290000000000022E-2,4.8900000000000256E-2]
[3600000,8.3799999999999694E-2,7.2799999999999532E-2,6.2800000000000217E-2,4.8800000000000253E-2]
[3650000,8.3699999999999691E-2,7.2699999999999529E-2,6.2700000000000214E-2,4.870000000000025E-2]
[3700000,8.3599999999999688E-2,7.2599999999999526E-2,6.2600000000000211E-2,4.8600000000000247E-2]
[3750000,8.3499999999999686E-2,7.2499999999999523E-2,6.2500000000000208E-2,4.8500000000000244E-2]
[3800000,8.3399999999999683E-2,7.239999999999952E-2,6.2400000000000212E-2,4.8400000000000241E-2]
[3850000,8.329999999999968E-2,7.2299999999999517E-2,6.2300000000000209E-2,4.8300000000000239E-2]
[3900000,8.3199999999999677E-2,7.2199999999999515E-2,6.2200000000000207E-2,4.8200000000000236E-2]
[3950000,8.3099999999999674E-2,7.2099999999999512E-2,6.2100000000000204E-2,4.8100000000000233E-2]
[4000000,8.2999999999999671E-2,7.1999999999999509E-2,6.2000000000000201E-2,4.800000000000023E-2]
[4050000,{"$f":"B154+0.0001","v":8.2899999999999668E-2},{"$f":"C154+0.0001","v":7.1899999999999506E-2},{"$f":"D154+0.0001","v":6.1900000000000198E-2},{"$f":"E154+0.0001","v":4.7900000000000227E-2}]
[4100000,{"$f":"B155+0.0001","v":8.2799999999999666E-2},7.1799999999999503E-2,6.1800000000000195E-2,4.7800000000000224E-2]
[4150000,8.2699999999999663E-2,7.16999999999995E-2,6.1700000000000192E-2,4.7700000000000221E-2]
[4200000,8.259999999999966E-2,7.1599999999999497E-2,6.1600000000000189E-2,4.7600000000000219E-2]
[4250000,8.2499999999999657E-2,7.1499999999999495E-2,6.1500000000000186E-2,4.7500000000000216E-2]
[4300000,8.2399999999999654E-2,7.1399999999999492E-2,6.1400000000000184E-2,4.7400000000000213E-2]
[4350000,8.2299999999999651E-2,7.1299999999999489E-2,6.1300000000000181E-2,4.730000000000021E-2]
[4400000,8.2199999999999648E-2,7.1199999999999486E-2,6.1200000000000178E-2,4.7200000000000207E-2]
[4450000,8.2099999999999645E-2,7.1099999999999483E-2,6.1100000000000175E-2,4.7100000000000204E-2]
[4500000,8.1999999999999643E-2,7.099999999999948E-2,6.1000000000000172E-2,4.7000000000000201E-2]
[4550000,{"$f":"B164+0.0001","v":8.189999999999964E-2},7.0899999999999477E-2,6.0900000000000169E-2,4.6900000000000198E-2]
[4600000,8.1799999999999637E-2,7.0799999999999474E-2,6.0800000000000166E-2,4.6800000000000196E-2]
[4650000,8.1699999999999634E-2,7.0699999999999472E-2,6.0700000000000164E-2,4.6700000000000193E-2]
[4700000,8.1599999999999631E-2,7.0599999999999469E-2,6.0600000000000161E-2,4.660000000000019E-2]
[4750000,8.1499999999999628E-2,7.0499999999999466E-2,6.0500000000000158E-2,4.6500000000000187E-2]
[4800000,8.1399999999999625E-2,7.0399999999999463E-2,6.0400000000000155E-2,4.6400000000000184E-2]
[4850000,8.1299999999999623E-2,7.029999999999946E-2,6.0300000000000152E-2,4.6300000000000181E-2]
[4900000,8.119999999999962E-2,7.0199999999999457E-2,6.0200000000000149E-2,4.6200000000000178E-2]
[4950000,8.1099999999999617E-2,7.0099999999999454E-2,6.0100000000000146E-2,4.6100000000000176E-2]
[5000000,8.0999999999999614E-2,{"$f":"C173+0.00005","v":6.9999999999999452E-2},6.0000000000000143E-2,4.6000000000000173E-2]
[5050000,{"$f":"B174+0.0001","v":8.0899999999999611E-2},6.9949999999999457E-2,5.9950000000000142E-2,{"$f":"E174+0.0001","v":4.590000000000017E-2}]
[5100000,{"$f":"B175+0.0001","v":8.0799999999999608E-2},6.9899999999999463E-2,5.9900000000000141E-2,4.5800000000000167E-2]
[5150000,8.0699999999999605E-2,6.9849999999999468E-2,5.9850000000000139E-2,4.5700000000000164E-2]
[5200000,8.0599999999999603E-2,6.9799999999999474E-2,5.9800000000000138E-2,4.5600000000000161E-2]
[5250000,8.04999999999996E-2,6.9749999999999479E-2,5.9750000000000136E-2,4.5500000000000158E-2]
[5300000,8.0399999999999597E-2,6.9699999999999485E-2,5.9700000000000135E-2,4.5400000000000156E-2]
[5350000,8.0299999999999594E-2,6.964999999999949E-2,5.9650000000000133E-2,4.5300000000000153E-2]
[5400000,8.0199999999999591E-2,6.9599999999999496E-2,5.9600000000000132E-2,4.520000000000015E-2]
[5450000,8.0099999999999588E-2,6.9549999999999501E-2,5.9550000000000131E-2,4.5100000000000147E-2]
[5500000,{"$f":"B183+0.0001","v":7.9999999999999585E-2},6.9499999999999507E-2,5.9500000000000129E-2,4.5000000000000144E-2]
[5550000,7.9899999999999582E-2,6.9449999999999512E-2,5.9450000000000128E-2,4.4900000000000141E-2]
[5600000,7.979999999999958E-2,6.9399999999999518E-2,5.9400000000000126E-2,4.4800000000000138E-2]
[5650000,7.9699999999999577E-2,6.9349999999999523E-2,5.9350000000000125E-2,4.4700000000000135E-2]
[5700000,7.9599999999999574E-2,6.9299999999999529E-2,5.9300000000000123E-2,4.4600000000000133E-2]
[5750000,7.9499999999999571E-2,6.9249999999999534E-2,5.9250000000000122E-2,4.450000000000013E-2]
[5800000,7.9399999999999568E-2,6.919999999999954E-2,5.9200000000000121E-2,4.4400000000000127E-2]
[5850000,7.9299999999999565E-2,6.9149999999999545E-2,5.9150000000000119E-2,4.4300000000000124E-2]
[5900000,7.9199999999999562E-2,6.9099999999999551E-2,5.9100000000000118E-2,4.4200000000000121E-2]
[5950000,7.909999999999956E-2,6.9049999999999556E-2,5.9050000000000116E-2,4.4100000000000118E-2]
[6000000,{"$f":"B193+0.00005","v":7.8999999999999557E-2},6.8999999999999562E-2,5.9000000000000115E-2,4.4000000000000115E-2]
[6050000,{"$f":"B194+0.00005","v":7.8949999999999562E-2},6.8949999999999567E-2,5.8950000000000113E-2,4.3950000000000114E-2]
[6100000,7.8899999999999568E-2,6.8899999999999573E-2,5.8900000000000112E-2,4.3900000000000113E-2]
[6150000,7.8849999999999573E-2,6.8849999999999578E-2,5.8850000000000111E-2,4.3850000000000111E-2]
[6200000,7.8799999999999579E-2,6.8799999999999584E-2,5.8800000000000109E-2,4.380000000000011E-2]
[6250000,7.8749999999999584E-2,6.8749999999999589E-2,5.8750000000000108E-2,4.3750000000000108E-2]
[6300000,7.869999999999959E-2,6.8699999999999595E-2,5.8700000000000106E-2,4.3700000000000107E-2]
[6350000,7.8649999999999595E-2,6.86499999999996E-2,5.8650000000000105E-2,4.3650000000000105E-2]
[6400000,7.8599999999999601E-2,6.8599999999999606E-2,5.8600000000000103E-2,4.3600000000000104E-2]
[6450000,{"$f":"B202+0.00005","v":7.8549999999999606E-2},{"$f":"C202+0.00005","v":6.8549999999999611E-2},{"$f":"D202+0.00005","v":5.8550000000000102E-2},{"$f":"E202+0.00005","v":4.3550000000000103E-2}]
[6500000,{"$f":"B203+0.00005","v":7.8499999999999612E-2},6.8499999999999617E-2,5.8500000000000101E-2,4.3500000000000101E-2]
[6550000,{"$f":"B204+0.00005","v":7.8449999999999617E-2},6.8449999999999622E-2,5.8450000000000099E-2,4.34500000000001E-2]
[{"$f":"A203+50000","v":6600000},7.8399999999999623E-2,6.8399999999999628E-2,5.8400000000000098E-2,4.3400000000000098E-2]
[6650000,7.8349999999999628E-2,6.8349999999999633E-2,5.8350000000000096E-2,4.3350000000000097E-2]
[6700000,7.8299999999999634E-2,6.8299999999999639E-2,5.8300000000000095E-2,4.3300000000000095E-2]
[6750000,7.8249999999999639E-2,6.8249999999999644E-2,5.8250000000000093E-2,4.3250000000000094E-2]
[6800000,7.8199999999999645E-2,6.819999999999965E-2,5.8200000000000092E-2,4.3200000000000092E-2]
[6850000,7.814999999999965E-2,6.8149999999999655E-2,5.8150000000000091E-2,4.3150000000000091E-2]
[6900000,7.8099999999999656E-2,6.8099999999999661E-2,5.8100000000000089E-2,4.310000000000009E-2]
[6950000,{"$f":"B212+0.00005","v":7.8049999999999661E-2},{"$f":"C212+0.00005","v":6.8049999999999666E-2},{"$f":"D212+0.00005","v":5.8050000000000088E-2},{"$f":"E212+0.00005","v":4.3050000000000088E-2}]
[7000000,{"$f":"B213+0.00005","v":7.7999999999999667E-2},6.7999999999999672E-2,5.8000000000000086E-2,4.3000000000000087E-2]
[7050000,{"$f":"B214+0.00005","v":7.7949999999999672E-2},6.7949999999999677E-2,5.7950000000000085E-2,4.2950000000000085E-2]
[7100000,7.7899999999999678E-2,6.7899999999999683E-2,5.7900000000000083E-2,4.2900000000000084E-2]
[7150000,7.7849999999999683E-2,6.7849999999999688E-2,5.7850000000000082E-2,4.2850000000000082E-2]
[7200000,7.7799999999999689E-2,6.7799999999999694E-2,5.780000000000008E-2,4.2800000000000081E-2]
[7250000,7.7749999999999694E-2,6.7749999999999699E-2,5.7750000000000079E-2,4.275000000000008E-2]
[7300000,7.76999999999997E-2,6.7699999999999705E-2,5.7700000000000078E-2,4.2700000000000078E-2]
[7350000,7.7649999999999705E-2,6.764999999999971E-2,5.7650000000000076E-2,4.2650000000000077E-2]
[7400000,7.7599999999999711E-2,6.7599999999999716E-2,5.7600000000000075E-2,4.2600000000000075E-2]
[7450000,{"$f":"B222+0.00005","v":7.7549999999999716E-2},{"$f":"C222+0.00005","v":6.7549999999999721E-2},{"$f":"D222+0.00005","v":5.7550000000000073E-2},{"$f":"E222+0.00005","v":4.2550000000000074E-2}]
[7500000,{"$f":"B223+0.00005","v":7.7499999999999722E-2},6.7499999999999727E-2,5.7500000000000072E-2,4.2500000000000072E-2]
[7550000,{"$f":"B224+0.00005","v":7.7449999999999727E-2},6.7449999999999732E-2,5.745000000000007E-2,4.2450000000000071E-2]
[7600000,7.7399999999999733E-2,6.7399999999999738E-2,5.7400000000000069E-2,4.240000000000007E-2]
[7650000,7.7349999999999738E-2,6.7349999999999743E-2,5.7350000000000068E-2,4.2350000000000068E-2]
[7700000,7.7299999999999744E-2,6.7299999999999749E-2,5.7300000000000066E-2,4.2300000000000067E-2]
[7750000,7.7249999999999749E-2,6.7249999999999754E-2,5.7250000000000065E-2,4.2250000000000065E-2]
[7800000,7.7199999999999755E-2,6.719999999999976E-2,5.7200000000000063E-2,4.2200000000000064E-2]
[7850000,7.714999999999976E-2,6.7149999999999765E-2,5.7150000000000062E-2,4.2150000000000062E-2]
[7900000,7.7099999999999766E-2,6.7099999999999771E-2,5.710000000000006E-2,4.2100000000000061E-2]
[7950000,{"$f":"B232+0.00005","v":7.7049999999999771E-2},{"$f":"C232+0.00005","v":6.7049999999999776E-2},{"$f":"D232+0.00005","v":5.7050000000000059E-2},{"$f":"E232+0.00005","v":4.205000000000006E-2}]
[8000000,{"$f":"B233+0.00005","v":7.6999999999999777E-2},6.6999999999999782E-2,5.7000000000000058E-2,4.2000000000000058E-2]
[8050000,{"$f":"B234+0.00005","v":7.6949999999999782E-2},6.6949999999999787E-2,5.6950000000000056E-2,4.1950000000000057E-2]
[8100000,7.6899999999999788E-2,6.6899999999999793E-2,5.6900000000000055E-2,4.1900000000000055E-2]
[8150000,7.6849999999999793E-2,6.6849999999999798E-2,5.6850000000000053E-2,4.1850000000000054E-2]
[8200000,7.6799999999999799E-2,6.6799999999999804E-2,5.6800000000000052E-2,4.1800000000000052E-2]
[8250000,7.6749999999999804E-2,6.6749999999999809E-2,5.675000000000005E-2,4.1750000000000051E-2]
[8300000,7.669999999999981E-2,6.6699999999999815E-2,5.6700000000000049E-2,4.170000000000005E-2]
[8350000,7.6649999999999816E-2,6.664999999999982E-2,5.6650000000000048E-2,4.1650000000000048E-2]
[8400000,7.6599999999999821E-2,6.6599999999999826E-2,5.6600000000000046E-2,4.1600000000000047E-2]
[8450000,{"$f":"B242+0.00005","v":7.6549999999999827E-2},{"$f":"C242+0.00005","v":6.6549999999999832E-2},{"$f":"D242+0.00005","v":5.6550000000000045E-2},{"$f":"E242+0.00005","v":4.1550000000000045E-2}]
[8500000,{"$f":"B243+0.00005","v":7.6499999999999832E-2},6.6499999999999837E-2,5.6500000000000043E-2,4.1500000000000044E-2]
[8550000,{"$f":"B244+0.00005","v":7.6449999999999838E-2},6.6449999999999843E-2,5.6450000000000042E-2,4.1450000000000042E-2]
[8600000,7.6399999999999843E-2,6.6399999999999848E-2,5.640000000000004E-2,4.1400000000000041E-2]
[8650000,7.6349999999999849E-2,6.6349999999999854E-2,5.6350000000000039E-2,4.135000000000004E-2]
[8700000,7.6299999999999854E-2,6.6299999999999859E-2,5.6300000000000038E-2,4.1300000000000038E-2]
[8750000,7.624999999999986E-2,6.6249999999999865E-2,5.6250000000000036E-2,4.1250000000000037E-2]
[8800000,7.6199999999999865E-2,6.619999999999987E-2,5.6200000000000035E-2,4.1200000000000035E-2]
[8850000,7.6149999999999871E-2,6.6149999999999876E-2,5.6150000000000033E-2,4.1150000000000034E-2]
[8900000,7.6099999999999876E-2,6.6099999999999881E-2,5.6100000000000032E-2,4.1100000000000032E-2]
[8950000,{"$f":"B252+0.00005","v":7.6049999999999882E-2},{"$f":"C252+0.00005","v":6.6049999999999887E-2},{"$f":"D252+0.00005","v":5.605000000000003E-2},{"$f":"E252+0.00005","v":4.1050000000000031E-2}]
[9000000,{"$f":"B253+0.00005","v":7.5999999999999887E-2},6.5999999999999892E-2,5.6000000000000029E-2,4.1000000000000029E-2]
[9050000,{"$f":"B254+0.00005","v":7.5949999999999893E-2},6.5949999999999898E-2,5.5950000000000027E-2,4.0950000000000028E-2]
[9100000,7.5899999999999898E-2,6.5899999999999903E-2,5.5900000000000026E-2,4.0900000000000027E-2]
[9150000,7.5849999999999904E-2,6.5849999999999909E-2,5.5850000000000025E-2,4.0850000000000025E-2]
[9200000,7.5799999999999909E-2,6.5799999999999914E-2,5.5800000000000023E-2,4.0800000000000024E-2]
[9250000,7.5749999999999915E-2,6.574999999999992E-2,5.5750000000000022E-2,4.0750000000000022E-2]
[9300000,7.569999999999992E-2,6.5699999999999925E-2,5.570000000000002E-2,4.0700000000000021E-2]
[9350000,7.5649999999999926E-2,6.5649999999999931E-2,5.5650000000000019E-2,4.0650000000000019E-2]
[9400000,7.5599999999999931E-2,6.5599999999999936E-2,5.5600000000000017E-2,4.0600000000000018E-2]
[9450000,{"$f":"B262+0.00005","v":7.5549999999999937E-2},{"$f":"C262+0.00005","v":6.5549999999999942E-2},{"$f":"D262+0.00005","v":5.5550000000000016E-2},{"$f":"E262+0.00005","v":4.0550000000000017E-2}]
[9500000,{"$f":"B263+0.00005","v":7.5499999999999942E-2},6.5499999999999947E-2,5.5500000000000015E-2,4.0500000000000015E-2]
[9550000,7.5449999999999948E-2,6.5449999999999953E-2,5.5450000000000013E-2,4.0450000000000014E-2]
[9600000,7.5399999999999953E-2,6.5399999999999958E-2,5.5400000000000012E-2,4.0400000000000012E-2]
[9650000,7.5349999999999959E-2,6.5349999999999964E-2,5.535000000000001E-2,4.0350000000000011E-2]
[9700000,7.5299999999999964E-2,6.5299999999999969E-2,5.5300000000000009E-2,4.0300000000000009E-2]
[9750000,7.524999999999997E-2,6.5249999999999975E-2,5.5250000000000007E-2,4.0250000000000008E-2]
[{"$f":"A267+50000","v":9800000},7.5199999999999975E-2,6.519999999999998E-2,5.5200000000000006E-2,4.0200000000000007E-2]
[9850000,7.5149999999999981E-2,6.5149999999999986E-2,5.5150000000000005E-2,4.0150000000000005E-2]
[9900000,7.5099999999999986E-2,6.5099999999999991E-2,5.5100000000000003E-2,4.0100000000000004E-2]
[9950000,{"$f":"B272+0.00005","v":7.5049999999999992E-2},{"$f":"C272+0.00005","v":6.5049999999999997E-2},{"$f":"D272+0.00005","v":5.5050000000000002E-2},{"$f":"E272+0.00005","v":4.0050000000000002E-2}]
[10000000,7.4999999999999997E-2,6.5000000000000002E-2,5.5E-2,0.04]
[{"$f":"A272+10000","v":10010000},{"$f":"B274+(0.0008/108)","v":7.4792592592593327E-2},{"$f":"C274+(0.0008/108)","v":6.4792592592593332E-2},5.4792592592592587E-2,3.9792592592592588E-2]
[{"$f":"A273+10000","v":10020000},7.4785185185185912E-2,6.4785185185185917E-2,5.478518518518518E-2,3.978518518518518E-2]
[10030000,7.4777777777778498E-2,6.4777777777778503E-2,5.4777777777777772E-2,3.9777777777777773E-2]
[10040000,7.4770370370371084E-2,6.4770370370371089E-2,5.4770370370370365E-2,3.9770370370370366E-2]
[10050000,7.4762962962963669E-2,6.4762962962963674E-2,5.4762962962962958E-2,3.9762962962962958E-2]
[{"$f":"A277+10000","v":10060000},7.4755555555556255E-2,6.475555555555626E-2,5.475555555555555E-2,3.9755555555555551E-2]
[{"$f":"A278+10000","v":10070000},7.4748148148148841E-2,6.4748148148148846E-2,5.4748148148148143E-2,3.9748148148148144E-2]
[10080000,7.4740740740741426E-2,6.4740740740741431E-2,5.4740740740740736E-2,3.9740740740740736E-2]
[10090000,7.4733333333334012E-2,6.4733333333334017E-2,5.4733333333333328E-2,3.9733333333333329E-2]
[10100000,7.4725925925926598E-2,6.4725925925926603E-2,5.4725925925925921E-2,3.9725925925925921E-2]
[{"$f":"A282+10000","v":10110000},7.4718518518519184E-2,6.4718518518519189E-2,5.4718518518518514E-2,3.9718518518518514E-2]
[{"$f":"A283+10000","v":10120000},7.4711111111111769E-2,6.4711111111111774E-2,5.4711111111111106E-2,3.9711111111111107E-2]
[10130000,7.4703703703704355E-2,6.470370370370436E-2,5.4703703703703699E-2,3.9703703703703699E-2]
[10140000,7.4696296296296941E-2,6.4696296296296946E-2,5.4696296296296291E-2,3.9696296296296292E-2]
[10150000,7.4688888888889526E-2,6.4688888888889531E-2,5.4688888888888884E-2,3.9688888888888885E-2]
[{"$f":"A287+10000","v":10160000},7.4681481481482112E-2,6.4681481481482117E-2,5.4681481481481477E-2,3.9681481481481477E-2]
[{"$f":"A288+10000","v":10170000},7.4674074074074698E-2,{"$f":"C290+(0.0008/108)","v":6.4674074074074703E-2},5.4674074074074069E-2,3.967407407407407E-2]
[10180000,7.4666666666667283E-2,6.4666666666667288E-2,5.4666666666666662E-2,3.9666666666666663E-2]
[10190000,7.4659259259259869E-2,6.4659259259259874E-2,5.4659259259259255E-2,3.9659259259259255E-2]
[10200000,7.4651851851852455E-2,6.465185185185246E-2,5.4651851851851847E-2,3.9651851851851848E-2]
[{"$f":"A292+10000","v":10210000},7.4644444444445041E-2,6.4644444444445046E-2,5.464444444444444E-2,3.964444444444444E-2]
[{"$f":"A293+10000","v":10220000},7.4637037037037626E-2,6.4637037037037631E-2,5.4637037037037033E-2,3.9637037037037033E-2]
[10230000,7.4629629629630212E-2,6.4629629629630217E-2,5.4629629629629625E-2,3.9629629629629626E-2]
[10240000,7.4622222222222798E-2,6.4622222222222803E-2,5.4622222222222218E-2,3.9622222222222218E-2]
[10250000,7.4614814814815383E-2,6.4614814814815388E-2,5.461481481481481E-2,3.9614814814814811E-2]
[{"$f":"A297+10000","v":10260000},7.4607407407407969E-2,6.4607407407407974E-2,5.4607407407407403E-2,3.9607407407407404E-2]
[{"$f":"A298+10000","v":10270000},7.4600000000000555E-2,6.460000000000056E-2,5.4599999999999996E-2,3.9599999999999996E-2]
[10280000,7.459259259259314E-2,6.4592592592593145E-2,5.4592592592592588E-2,3.9592592592592589E-2]
[10290000,7.4585185185185726E-2,6.4585185185185731E-2,5.4585185185185181E-2,3.9585185185185182E-2]
[10300000,7.4577777777778312E-2,6.4577777777778317E-2,5.4577777777777774E-2,3.9577777777777774E-2]
[{"$f":"A302+10000","v":10310000},7.4570370370370898E-2,6.4570370370370903E-2,5.4570370370370366E-2,3.9570370370370367E-2]
[{"$f":"A303+10000","v":10320000},7.4562962962963483E-2,6.4562962962963488E-2,5.4562962962962959E-2,3.956296296296296E-2]
[10330000,{"$f":"B306+(0.0008/108)","v":7.4555555555556069E-2},{"$f":"C306+(0.0008/108)","v":6.4555555555556074E-2},5.4555555555555552E-2,3.9555555555555552E-2]
[10340000,7.4548148148148655E-2,6.454814814814866E-2,5.4548148148148144E-2,3.9548148148148145E-2]
[10350000,7.454074074074124E-2,6.4540740740741245E-2,5.4540740740740737E-2,3.9540740740740737E-2]
[{"$f":"A307+10000","v":10360000},7.4533333333333826E-2,6.4533333333333831E-2,5.4533333333333329E-2,3.953333333333333E-2]
[{"$f":"A308+10000","v":10370000},7.4525925925926412E-2,6.4525925925926417E-2,5.4525925925925922E-2,3.9525925925925923E-2]
[10380000,7.4518518518518997E-2,6.4518518518519002E-2,5.4518518518518515E-2,3.9518518518518515E-2]
[10390000,7.4511111111111583E-2,6.4511111111111588E-2,5.4511111111111107E-2,3.9511111111111108E-2]
[10400000,7.4503703703704169E-2,6.4503703703704174E-2,5.45037037037037E-2,3.9503703703703701E-2]
[{"$f":"A312+10000","v":10410000},7.4496296296296755E-2,6.449629629629676E-2,5.4496296296296293E-2,3.9496296296296293E-2]
[{"$f":"A313+10000","v":10420000},7.448888888888934E-2,6.4488888888889345E-2,5.4488888888888885E-2,3.9488888888888886E-2]
[10430000,7.4481481481481926E-2,6.4481481481481931E-2,5.4481481481481478E-2,3.9481481481481479E-2]
[10440000,7.4474074074074512E-2,6.4474074074074517E-2,5.4474074074074071E-2,3.9474074074074071E-2]
[10450000,7.4466666666667097E-2,6.4466666666667102E-2,5.4466666666666663E-2,3.9466666666666664E-2]
[{"$f":"A317+10000","v":10460000},7.4459259259259683E-2,6.4459259259259688E-2,5.4459259259259256E-2,3.9459259259259256E-2]
[{"$f":"A318+10000","v":10470000},7.4451851851852269E-2,6.4451851851852274E-2,5.4451851851851849E-2,3.9451851851851849E-2]
[10480000,7.4444444444444854E-2,6.4444444444444859E-2,5.4444444444444441E-2,3.9444444444444442E-2]
[10490000,7.443703703703744E-2,{"$f":"C322+(0.0008/108)","v":6.4437037037037445E-2},5.4437037037037034E-2,3.9437037037037034E-2]
[10500000,7.4429629629630026E-2,6.4429629629630031E-2,5.4429629629629626E-2,3.9429629629629627E-2]
[{"$f":"A322+10000","v":10510000},7.4422222222222612E-2,6.4422222222222617E-2,5.4422222222222219E-2,3.942222222222222E-2]
[{"$f":"A323+10000","v":10520000},7.4414814814815197E-2,6.4414814814815202E-2,5.4414814814814812E-2,3.9414814814814812E-2]
[10530000,7.4407407407407783E-2,6.4407407407407788E-2,5.4407407407407404E-2,3.9407407407407405E-2]
[10540000,7.4400000000000369E-2,6.4400000000000374E-2,5.4399999999999997E-2,3.9399999999999998E-2]
[10550000,7.4392592592592954E-2,6.4392592592592959E-2,5.439259259259259E-2,3.939259259259259E-2]
[{"$f":"A327+10000","v":10560000},7.438518518518554E-2,6.4385185185185545E-2,5.4385185185185182E-2,3.9385185185185183E-2]
[{"$f":"A328+10000","v":10570000},7.4377777777778126E-2,6.4377777777778131E-2,5.4377777777777775E-2,3.9377777777777775E-2]
[10580000,7.4370370370370711E-2,6.4370370370370716E-2,5.4370370370370368E-2,3.9370370370370368E-2]
[10590000,7.4362962962963297E-2,6.4362962962963302E-2,5.436296296296296E-2,3.9362962962962961E-2]
[10600000,7.4355555555555883E-2,6.4355555555555888E-2,5.4355555555555553E-2,3.9355555555555553E-2]
[{"$f":"A332+10000","v":10610000},7.4348148148148469E-2,6.4348148148148474E-2,5.4348148148148145E-2,3.9348148148148146E-2]
[{"$f":"A333+10000","v":10620000},7.4340740740741054E-2,6.4340740740741059E-2,5.4340740740740738E-2,3.9340740740740739E-2]
[10630000,7.433333333333364E-2,6.4333333333333645E-2,5.4333333333333331E-2,3.9333333333333331E-2]
[10640000,7.4325925925926226E-2,6.4325925925926231E-2,5.4325925925925923E-2,3.9325925925925924E-2]
[10650000,{"$f":"B338+(0.0008/108)","v":7.4318518518518811E-2},{"$f":"C338+(0.0008/108)","v":6.4318518518518816E-2},5.4318518518518516E-2,3.9318518518518517E-2]
[{"$f":"A337+10000","v":10660000},7.4311111111111397E-2,6.4311111111111402E-2,5.4311111111111109E-2,3.9311111111111109E-2]
[{"$f":"A338+10000","v":10670000},7.4303703703703983E-2,6.4303703703703988E-2,5.4303703703703701E-2,3.9303703703703702E-2]
[10680000,7.4296296296296568E-2,6.4296296296296573E-2,5.4296296296296294E-2,3.9296296296296294E-2]
[10690000,7.4288888888889154E-2,6.4288888888889159E-2,5.4288888888888887E-2,3.9288888888888887E-2]
[10700000,7.428148148148174E-2,6.4281481481481745E-2,5.4281481481481479E-2,3.928148148148148E-2]
[{"$f":"A342+10000","v":10710000},7.4274074074074325E-2,6.427407407407433E-2,5.4274074074074072E-2,3.9274074074074072E-2]
[{"$f":"A343+10000","v":10720000},7.4266666666666911E-2,6.4266666666666916E-2,5.4266666666666664E-2,3.9266666666666665E-2]
[10730000,7.4259259259259497E-2,6.4259259259259502E-2,5.4259259259259257E-2,3.9259259259259258E-2]
[10740000,7.4251851851852083E-2,6.4251851851852088E-2,5.425185185185185E-2,3.925185185185185E-2]
[10750000,7.4244444444444668E-2,6.4244444444444673E-2,5.4244444444444442E-2,3.9244444444444443E-2]
[{"$f":"A347+10000","v":10760000},7.4237037037037254E-2,6.4237037037037259E-2,5.4237037037037035E-2,3.9237037037037036E-2]
[{"$f":"A348+10000","v":10770000},7.422962962962984E-2,6.4229629629629845E-2,5.4229629629629628E-2,3.9229629629629628E-2]
[10780000,7.4222222222222425E-2,6.422222222222243E-2,5.422222222222222E-2,3.9222222222222221E-2]
[10790000,7.4214814814815011E-2,6.4214814814815016E-2,5.4214814814814813E-2,3.9214814814814813E-2]
[10800000,7.4207407407407597E-2,6.4207407407407602E-2,5.4207407407407406E-2,3.9207407407407406E-2]
[{"$f":"A352+10000","v":10810000},7.4200000000000182E-2,{"$f":"C354+(0.0008/108)","v":6.4200000000000187E-2},5.4199999999999998E-2,3.9199999999999999E-2]
[{"$f":"A353+10000","v":10820000},7.4192592592592768E-2,6.4192592592592773E-2,5.4192592592592591E-2,3.9192592592592591E-2]
[10830000,7.4185185185185354E-2,6.4185185185185359E-2,5.4185185185185183E-2,3.9185185185185184E-2]
[10840000,7.417777777777794E-2,6.4177777777777945E-2,5.4177777777777776E-2,3.9177777777777777E-2]
[10850000,7.4170370370370525E-2,6.417037037037053E-2,5.4170370370370369E-2,3.9170370370370369E-2]
[{"$f":"A357+50000","v":10900000},7.4162962962963111E-2,6.4162962962963116E-2,5.4162962962962961E-2,3.9162962962962962E-2]
[10950000,7.4155555555555697E-2,6.4155555555555702E-2,5.4155555555555554E-2,3.9155555555555555E-2]
[11000000,7.4148148148148282E-2,6.4148148148148287E-2,5.4148148148148147E-2,3.9148148148148147E-2]
[11050000,7.4140740740740868E-2,6.4140740740740873E-2,5.4140740740740739E-2,3.914074074074074E-2]
[11100000,7.4133333333333454E-2,6.4133333333333459E-2,5.4133333333333332E-2,3.9133333333333332E-2]
[11150000,7.4125925925926039E-2,6.4125925925926044E-2,5.4125925925925925E-2,3.9125925925925925E-2]
[11200000,7.4118518518518625E-2,6.411851851851863E-2,5.4118518518518517E-2,3.9118518518518518E-2]
[11250000,7.4111111111111211E-2,6.4111111111111216E-2,5.411111111111111E-2,3.911111111111111E-2]
[11300000,7.4103703703703797E-2,6.4103703703703802E-2,5.4103703703703702E-2,3.9103703703703703E-2]
[11350000,7.4096296296296382E-2,6.4096296296296387E-2,5.4096296296296295E-2,3.9096296296296296E-2]
[11400000,7.4088888888888968E-2,6.4088888888888973E-2,5.4088888888888888E-2,3.9088888888888888E-2]
[11450000,{"$f":"B370+(0.0008/108)","v":7.4081481481481554E-2},{"$f":"C370+(0.0008/108)","v":6.4081481481481559E-2},5.408148148148148E-2,3.9081481481481481E-2]
[11500000,7.4074074074074139E-2,6.4074074074074144E-2,5.4074074074074073E-2,3.9074074074074074E-2]
[11550000,7.4066666666666725E-2,6.406666666666673E-2,5.4066666666666666E-2,3.9066666666666666E-2]
[11600000,7.4059259259259311E-2,6.4059259259259316E-2,5.4059259259259258E-2,3.9059259259259259E-2]
[11650000,7.4051851851851896E-2,6.4051851851851901E-2,5.4051851851851851E-2,3.9051851851851851E-2]
[11700000,7.4044444444444482E-2,6.4044444444444487E-2,5.4044444444444444E-2,3.9044444444444444E-2]
[11750000,7.4037037037037068E-2,6.4037037037037073E-2,5.4037037037037036E-2,3.9037037037037037E-2]
[11800000,7.4029629629629654E-2,6.4029629629629659E-2,5.4029629629629629E-2,3.9029629629629629E-2]
[11850000,7.4022222222222239E-2,6.4022222222222244E-2,5.4022222222222221E-2,3.9022222222222222E-2]
[11900000,7.4014814814814825E-2,6.401481481481483E-2,5.4014814814814814E-2,3.9014814814814815E-2]
[11950000,7.4007407407407411E-2,6.4007407407407416E-2,5.4007407407407407E-2,3.9007407407407407E-2]
[12000000,7.3999999999999996E-2,6.4000000000000001E-2,5.3999999999999999E-2,3.9E-2]
[12050000,{"$f":"B382+(0.00089/59)","v":7.3890000000000122E-2},{"$f":"C382+(0.00089/59)","v":6.3890000000000127E-2},5.3890000000000125E-2,3.8890000000000126E-2]
[12100000,7.3874915254237408E-2,6.3874915254237413E-2,5.3874915254237411E-2,3.8874915254237412E-2]
[12150000,7.3859830508474694E-2,6.3859830508474699E-2,5.3859830508474697E-2,3.8859830508474698E-2]
[12200000,7.384474576271198E-2,6.3844745762711985E-2,5.3844745762711983E-2,3.8844745762711984E-2]
[12250000,7.3829661016949266E-2,6.3829661016949271E-2,5.3829661016949269E-2,3.882966101694927E-2]
[12300000,7.3814576271186552E-2,6.3814576271186557E-2,5.3814576271186555E-2,3.8814576271186556E-2]
[12350000,7.3799491525423838E-2,6.3799491525423843E-2,5.3799491525423841E-2,3.8799491525423842E-2]
[12400000,7.3784406779661124E-2,6.3784406779661129E-2,5.3784406779661127E-2,3.8784406779661128E-2]
[12450000,7.376932203389841E-2,6.3769322033898415E-2,5.3769322033898413E-2,3.8769322033898414E-2]
[12500000,7.3754237288135696E-2,6.3754237288135701E-2,5.3754237288135699E-2,3.87542372881357E-2]
[12550000,7.3739152542372982E-2,6.3739152542372987E-2,5.3739152542372985E-2,3.8739152542372986E-2]
[12600000,7.3724067796610268E-2,6.3724067796610273E-2,5.3724067796610271E-2,3.8724067796610272E-2]
[12650000,7.3708983050847554E-2,6.3708983050847559E-2,5.3708983050847557E-2,3.8708983050847558E-2]
[12700000,7.369389830508484E-2,6.3693898305084845E-2,5.3693898305084843E-2,3.8693898305084844E-2]
[12750000,7.3678813559322126E-2,6.3678813559322131E-2,5.3678813559322129E-2,3.867881355932213E-2]
[12800000,7.3663728813559412E-2,6.3663728813559417E-2,5.3663728813559415E-2,3.8663728813559416E-2]
[12850000,7.3648644067796698E-2,{"$f":"C398+(0.00089/59)","v":6.3648644067796703E-2},5.3648644067796701E-2,3.8648644067796702E-2]
[12900000,7.3633559322033984E-2,6.3633559322033989E-2,5.3633559322033987E-2,3.8633559322033988E-2]
[12950000,7.361847457627127E-2,6.3618474576271275E-2,5.3618474576271273E-2,3.8618474576271274E-2]
[13000000,7.3603389830508556E-2,6.3603389830508561E-2,5.3603389830508559E-2,3.860338983050856E-2]
[13050000,7.3588305084745842E-2,6.3588305084745847E-2,5.3588305084745845E-2,3.8588305084745846E-2]
[13100000,7.3573220338983128E-2,6.3573220338983133E-2,5.3573220338983131E-2,3.8573220338983132E-2]
[13150000,7.3558135593220414E-2,6.3558135593220419E-2,5.3558135593220417E-2,3.8558135593220418E-2]
[13200000,7.35430508474577E-2,6.3543050847457705E-2,5.3543050847457703E-2,3.8543050847457704E-2]
[13250000,7.3527966101694986E-2,6.3527966101694991E-2,5.3527966101694989E-2,3.852796610169499E-2]
[13300000,7.3512881355932272E-2,6.3512881355932277E-2,5.3512881355932275E-2,3.8512881355932276E-2]
[13350000,7.3497796610169558E-2,6.3497796610169563E-2,5.3497796610169561E-2,3.8497796610169562E-2]
[13400000,7.3482711864406844E-2,6.3482711864406849E-2,5.3482711864406847E-2,3.8482711864406847E-2]
[13450000,7.346762711864413E-2,6.3467627118644135E-2,5.3467627118644133E-2,3.8467627118644133E-2]
[13500000,7.3452542372881416E-2,6.3452542372881421E-2,5.3452542372881419E-2,3.8452542372881419E-2]
[13550000,7.3437457627118702E-2,6.3437457627118707E-2,5.3437457627118705E-2,3.8437457627118705E-2]
[13600000,7.3422372881355988E-2,6.3422372881355993E-2,5.3422372881355991E-2,3.8422372881355991E-2]
[13650000,{"$f":"B414+(0.00089/59)","v":7.3407288135593274E-2},{"$f":"C414+(0.00089/59)","v":6.3407288135593279E-2},5.3407288135593277E-2,3.8407288135593277E-2]
[13700000,7.339220338983056E-2,6.3392203389830565E-2,5.3392203389830563E-2,3.8392203389830563E-2]
[13750000,7.3377118644067846E-2,6.3377118644067851E-2,5.3377118644067849E-2,3.8377118644067849E-2]
[13800000,7.3362033898305132E-2,6.3362033898305137E-2,5.3362033898305135E-2,3.8362033898305135E-2]
[13850000,7.3346949152542418E-2,6.3346949152542423E-2,5.3346949152542421E-2,3.8346949152542421E-2]
[13900000,7.3331864406779704E-2,6.3331864406779709E-2,5.3331864406779707E-2,3.8331864406779707E-2]
[13950000,7.331677966101699E-2,6.3316779661016995E-2,5.3316779661016993E-2,3.8316779661016993E-2]
[14000000,7.3301694915254276E-2,6.3301694915254281E-2,5.3301694915254279E-2,3.8301694915254279E-2]
[14050000,7.3286610169491562E-2,6.3286610169491567E-2,5.3286610169491565E-2,3.8286610169491565E-2]
[{"$f":"A421+50000","v":14100000},7.3271525423728848E-2,6.3271525423728853E-2,5.3271525423728851E-2,3.8271525423728851E-2]
[14150000,7.3256440677966134E-2,6.3256440677966139E-2,5.3256440677966137E-2,3.8256440677966137E-2]
[14200000,7.324135593220342E-2,6.3241355932203425E-2,5.3241355932203423E-2,3.8241355932203423E-2]
[14250000,7.3226271186440706E-2,6.3226271186440711E-2,5.3226271186440709E-2,3.8226271186440709E-2]
[14300000,7.3211186440677992E-2,6.3211186440677997E-2,5.3211186440677995E-2,3.8211186440677995E-2]
[14350000,7.3196101694915278E-2,6.3196101694915283E-2,5.3196101694915281E-2,3.8196101694915281E-2]
[14400000,7.3181016949152564E-2,6.3181016949152569E-2,5.3181016949152567E-2,3.8181016949152567E-2]
[14450000,7.316593220338985E-2,{"$f":"C430+(0.00089/59)","v":6.3165932203389855E-2},5.3165932203389853E-2,3.8165932203389853E-2]
[14500000,7.3150847457627136E-2,6.3150847457627141E-2,5.3150847457627139E-2,3.8150847457627139E-2]
[14550000,7.3135762711864422E-2,6.3135762711864427E-2,5.3135762711864425E-2,3.8135762711864425E-2]
[14600000,7.3120677966101708E-2,6.3120677966101713E-2,5.3120677966101711E-2,3.8120677966101711E-2]
[14650000,7.3105593220338994E-2,6.3105593220338999E-2,5.3105593220338997E-2,3.8105593220338997E-2]
[14700000,7.309050847457628E-2,6.3090508474576285E-2,5.3090508474576283E-2,3.8090508474576283E-2]
[14750000,7.3075423728813566E-2,6.3075423728813571E-2,5.3075423728813569E-2,3.8075423728813569E-2]
[14800000,7.3060338983050852E-2,6.3060338983050856E-2,5.3060338983050855E-2,3.8060338983050855E-2]
[14850000,7.3045254237288137E-2,6.3045254237288142E-2,5.3045254237288141E-2,3.8045254237288141E-2]
[14900000,7.3030169491525423E-2,6.3030169491525428E-2,5.3030169491525427E-2,3.8030169491525427E-2]
[14950000,7.3015084745762709E-2,6.3015084745762714E-2,5.3015084745762713E-2,3.8015084745762713E-2]
[15000000,7.2999999999999995E-2,6.3E-2,5.2999999999999999E-2,3.7999999999999999E-2]
[15050000,{"$f":"B442+(0.0015/159)","v":7.2933962264150498E-2},{"$f":"C442+(0.0015/159)","v":6.2933962264150864E-2},5.2933962264151188E-2,3.7933962264151189E-2]
[15100000,7.2924528301886352E-2,6.2924528301886717E-2,5.2924528301887035E-2,3.7924528301887035E-2]
[15150000,7.2915094339622205E-2,6.2915094339622571E-2,5.2915094339622881E-2,3.7915094339622882E-2]
[15200000,7.2905660377358059E-2,6.2905660377358424E-2,5.2905660377358728E-2,3.7905660377358728E-2]
[15250000,7.2896226415093912E-2,6.2896226415094278E-2,5.2896226415094574E-2,3.7896226415094575E-2]
[15300000,7.2886792452829766E-2,6.2886792452830131E-2,5.2886792452830421E-2,3.7886792452830421E-2]
[15350000,7.2877358490565619E-2,6.2877358490565985E-2,5.2877358490566267E-2,3.7877358490566268E-2]
[15400000,7.2867924528301473E-2,6.2867924528301838E-2,5.2867924528302114E-2,3.7867924528302115E-2]
[15450000,7.2858490566037326E-2,6.2858490566037692E-2,5.2858490566037961E-2,3.7858490566037961E-2]
[15500000,7.284905660377318E-2,6.2849056603773545E-2,5.2849056603773807E-2,3.7849056603773808E-2]
[15550000,7.2839622641509033E-2,6.2839622641509399E-2,5.2839622641509654E-2,3.7839622641509654E-2]
[15600000,7.2830188679244887E-2,6.2830188679245252E-2,5.28301886792455E-2,3.7830188679245501E-2]
[15650000,7.282075471698074E-2,6.2820754716981106E-2,5.2820754716981347E-2,3.7820754716981347E-2]
[15700000,7.2811320754716594E-2,6.2811320754716959E-2,5.2811320754717193E-2,3.7811320754717194E-2]
[15750000,7.2801886792452447E-2,6.2801886792452813E-2,5.280188679245304E-2,3.7801886792453041E-2]
[15800000,7.2792452830188301E-2,6.2792452830188666E-2,5.2792452830188887E-2,3.7792452830188887E-2]
[15850000,7.2783018867924154E-2,{"$f":"C458+(0.0015/159)","v":6.278301886792452E-2},5.2783018867924733E-2,3.7783018867924734E-2]
[15900000,7.2773584905660008E-2,6.2773584905660373E-2,5.277358490566058E-2,3.777358490566058E-2]
[15950000,7.2764150943395861E-2,6.2764150943396227E-2,5.2764150943396426E-2,3.7764150943396427E-2]
[16000000,7.2754716981131715E-2,6.275471698113208E-2,5.2754716981132273E-2,3.7754716981132273E-2]
[16050000,7.2745283018867568E-2,6.2745283018867934E-2,5.2745283018868119E-2,3.774528301886812E-2]
[16100000,7.2735849056603422E-2,6.2735849056603787E-2,5.2735849056603966E-2,3.7735849056603966E-2]
[16150000,7.2726415094339275E-2,6.2726415094339641E-2,5.2726415094339812E-2,3.7726415094339813E-2]
[16200000,7.2716981132075129E-2,6.2716981132075494E-2,5.2716981132075659E-2,3.771698113207566E-2]
[16250000,7.2707547169810982E-2,6.2707547169811348E-2,5.2707547169811506E-2,3.7707547169811506E-2]
[16300000,7.2698113207546836E-2,6.2698113207547201E-2,5.2698113207547352E-2,3.7698113207547353E-2]
[16350000,7.2688679245282689E-2,6.2688679245283055E-2,5.2688679245283199E-2,3.7688679245283199E-2]
[16400000,7.2679245283018543E-2,6.2679245283018908E-2,5.2679245283019045E-2,3.7679245283019046E-2]
[16450000,7.2669811320754396E-2,6.2669811320754762E-2,5.2669811320754892E-2,3.7669811320754892E-2]
[16500000,7.266037735849025E-2,6.2660377358490615E-2,5.2660377358490738E-2,3.7660377358490739E-2]
[16550000,7.2650943396226103E-2,6.2650943396226469E-2,5.2650943396226585E-2,3.7650943396226585E-2]
[16600000,7.2641509433961957E-2,6.2641509433962322E-2,5.2641509433962431E-2,3.7641509433962432E-2]
[16650000,{"$f":"B474+(0.0015/159)","v":7.263207547169781E-2},{"$f":"C474+(0.0015/159)","v":6.2632075471698176E-2},5.2632075471698278E-2,3.7632075471698279E-2]
[16700000,7.2622641509433664E-2,6.2622641509434029E-2,5.2622641509434125E-2,3.7622641509434125E-2]
[16750000,7.2613207547169517E-2,6.2613207547169883E-2,5.2613207547169971E-2,3.7613207547169972E-2]
[16800000,7.2603773584905371E-2,6.2603773584905736E-2,5.2603773584905818E-2,3.7603773584905818E-2]
[16850000,7.2594339622641224E-2,6.259433962264159E-2,5.2594339622641664E-2,3.7594339622641665E-2]
[16900000,7.2584905660377078E-2,6.2584905660377443E-2,5.2584905660377511E-2,3.7584905660377511E-2]
[16950000,7.2575471698112931E-2,6.2575471698113297E-2,5.2575471698113357E-2,3.7575471698113358E-2]
[17000000,7.2566037735848785E-2,6.256603773584915E-2,5.2566037735849204E-2,3.7566037735849205E-2]
[17050000,7.2556603773584638E-2,6.2556603773585004E-2,5.2556603773585051E-2,3.7556603773585051E-2]
[17100000,7.2547169811320492E-2,6.2547169811320857E-2,5.2547169811320897E-2,3.7547169811320898E-2]
[17150000,7.2537735849056345E-2,6.2537735849056711E-2,5.2537735849056744E-2,3.7537735849056744E-2]
[17200000,7.2528301886792199E-2,6.2528301886792564E-2,5.252830188679259E-2,3.7528301886792591E-2]
[17250000,7.2518867924528052E-2,6.2518867924528418E-2,5.2518867924528437E-2,3.7518867924528437E-2]
[{"$f":"A485+50000","v":17300000},7.2509433962263906E-2,6.2509433962264271E-2,5.2509433962264283E-2,3.7509433962264284E-2]
[17350000,7.2499999999999759E-2,6.2500000000000125E-2,5.250000000000013E-2,3.750000000000013E-2]
[17400000,7.2490566037735613E-2,6.2490566037735978E-2,5.2490566037735976E-2,3.7490566037735977E-2]
[17450000,7.2481132075471466E-2,{"$f":"C490+(0.0015/159)","v":6.2481132075471825E-2},5.2481132075471823E-2,3.7481132075471824E-2]
[17500000,7.247169811320732E-2,6.2471698113207672E-2,5.247169811320767E-2,3.747169811320767E-2]
[17550000,7.2462264150943173E-2,6.2462264150943518E-2,5.2462264150943516E-2,3.7462264150943517E-2]
[17600000,7.2452830188679027E-2,6.2452830188679365E-2,5.2452830188679363E-2,3.7452830188679363E-2]
[17650000,7.244339622641488E-2,6.2443396226415211E-2,5.2443396226415209E-2,3.744339622641521E-2]
[17700000,7.2433962264150734E-2,6.2433962264151058E-2,5.2433962264151056E-2,3.7433962264151056E-2]
[17750000,7.2424528301886587E-2,6.2424528301886904E-2,5.2424528301886902E-2,3.7424528301886903E-2]
[17800000,7.2415094339622441E-2,6.2415094339622751E-2,5.2415094339622749E-2,3.7415094339622749E-2]
[17850000,7.2405660377358294E-2,6.2405660377358597E-2,5.2405660377358596E-2,3.7405660377358596E-2]
[17900000,7.2396226415094148E-2,6.2396226415094444E-2,5.2396226415094442E-2,3.7396226415094443E-2]
[17950000,7.2386792452830001E-2,6.2386792452830291E-2,5.2386792452830289E-2,3.7386792452830289E-2]
[18000000,7.2377358490565855E-2,6.2377358490566137E-2,5.2377358490566135E-2,3.7377358490566136E-2]
[18050000,7.2367924528301708E-2,6.2367924528301984E-2,5.2367924528301982E-2,3.7367924528301982E-2]
[18100000,7.2358490566037562E-2,6.235849056603783E-2,5.2358490566037828E-2,3.7358490566037829E-2]
[18150000,7.2349056603773415E-2,6.2349056603773677E-2,5.2349056603773675E-2,3.7349056603773675E-2]
[18200000,7.2339622641509269E-2,6.2339622641509523E-2,5.2339622641509521E-2,3.7339622641509522E-2]
[18250000,{"$f":"B506+(0.0015/159)","v":7.2330188679245122E-2},{"$f":"C506+(0.0015/159)","v":6.233018867924537E-2},5.2330188679245368E-2,3.7330188679245369E-2]
[18300000,7.2320754716980976E-2,6.2320754716981216E-2,5.2320754716981215E-2,3.7320754716981215E-2]
[18350000,7.2311320754716829E-2,6.2311320754717063E-2,5.2311320754717061E-2,3.7311320754717062E-2]
[18400000,7.2301886792452683E-2,6.230188679245291E-2,5.2301886792452908E-2,3.7301886792452908E-2]
[18450000,7.2292452830188536E-2,6.2292452830188756E-2,5.2292452830188754E-2,3.7292452830188755E-2]
[18500000,7.228301886792439E-2,6.2283018867924603E-2,5.2283018867924601E-2,3.7283018867924601E-2]
[18550000,7.2273584905660243E-2,6.2273584905660449E-2,5.2273584905660447E-2,3.7273584905660448E-2]
[18600000,7.2264150943396097E-2,6.2264150943396296E-2,5.2264150943396294E-2,3.7264150943396294E-2]
[18650000,7.225471698113195E-2,6.2254716981132142E-2,5.225471698113214E-2,3.7254716981132141E-2]
[18700000,7.2245283018867804E-2,6.2245283018867989E-2,5.2245283018867987E-2,3.7245283018867988E-2]
[18750000,7.2235849056603657E-2,6.2235849056603836E-2,5.2235849056603834E-2,3.7235849056603834E-2]
[18800000,7.2226415094339511E-2,6.2226415094339682E-2,5.222641509433968E-2,3.7226415094339681E-2]
[18850000,7.2216981132075364E-2,6.2216981132075529E-2,5.2216981132075527E-2,3.7216981132075527E-2]
[18900000,7.2207547169811218E-2,6.2207547169811375E-2,5.2207547169811373E-2,3.7207547169811374E-2]
[18950000,7.2198113207547071E-2,6.2198113207547222E-2,5.219811320754722E-2,3.719811320754722E-2]
[19000000,7.2188679245282925E-2,6.2188679245283068E-2,5.2188679245283066E-2,3.7188679245283067E-2]
[19050000,7.2179245283018778E-2,{"$f":"C522+(0.0015/159)","v":6.2179245283018915E-2},5.2179245283018913E-2,3.7179245283018914E-2]
[19100000,7.2169811320754632E-2,6.2169811320754761E-2,5.216981132075476E-2,3.716981132075476E-2]
[19150000,7.2160377358490485E-2,6.2160377358490608E-2,5.2160377358490606E-2,3.7160377358490607E-2]
[19200000,7.2150943396226339E-2,6.2150943396226455E-2,5.2150943396226453E-2,3.7150943396226453E-2]
[19250000,7.2141509433962192E-2,6.2141509433962301E-2,5.2141509433962299E-2,3.71415094339623E-2]
[19300000,7.2132075471698046E-2,6.2132075471698148E-2,5.2132075471698146E-2,3.7132075471698146E-2]
[19350000,7.2122641509433899E-2,6.2122641509433994E-2,5.2122641509433992E-2,3.7122641509433993E-2]
[19400000,7.2113207547169753E-2,6.2113207547169841E-2,5.2113207547169839E-2,3.7113207547169839E-2]
[19450000,7.2103773584905606E-2,6.2103773584905687E-2,5.2103773584905685E-2,3.7103773584905686E-2]
[19500000,7.209433962264146E-2,6.2094339622641534E-2,5.2094339622641532E-2,3.7094339622641533E-2]
[19550000,7.2084905660377313E-2,6.2084905660377381E-2,5.2084905660377379E-2,3.7084905660377379E-2]
[19600000,7.2075471698113167E-2,6.2075471698113227E-2,5.2075471698113225E-2,3.7075471698113226E-2]
[19650000,7.206603773584902E-2,6.2066037735849074E-2,5.2066037735849072E-2,3.7066037735849072E-2]
[19700000,7.2056603773584874E-2,6.205660377358492E-2,5.2056603773584918E-2,3.7056603773584919E-2]
[19750000,7.2047169811320727E-2,6.2047169811320767E-2,5.2047169811320765E-2,3.7047169811320765E-2]
[19800000,7.2037735849056581E-2,6.2037735849056613E-2,5.2037735849056611E-2,3.7037735849056612E-2]
[19850000,7.2028301886792434E-2,{"$f":"C538+(0.0015/159)","v":6.202830188679246E-2},5.2028301886792458E-2,3.7028301886792458E-2]
[19900000,7.2018867924528288E-2,6.2018867924528306E-2,5.2018867924528304E-2,3.7018867924528305E-2]
[19950000,7.2009433962264141E-2,6.2009433962264153E-2,5.2009433962264151E-2,3.7009433962264152E-2]
[20000000,7.1999999999999995E-2,6.2E-2,5.1999999999999998E-2,3.6999999999999998E-2]
[{"$f":"A540+10000","v":20010000},{"$f":"B542+(0.001/268)","v":7.1996268656718237E-2},{"$f":"C542+(0.001/268)","v":6.199626865671639E-2},5.1996268656716388E-2,3.6996268656716388E-2]
[{"$f":"A541+10000","v":20020000},7.1992537313434649E-2,6.1992537313432808E-2,5.1992537313432806E-2,3.6992537313432806E-2]
[20030000,7.198880597015106E-2,6.1988805970149226E-2,5.1988805970149224E-2,3.6988805970149224E-2]
[20040000,7.1985074626867471E-2,6.1985074626865644E-2,5.1985074626865642E-2,3.6985074626865642E-2]
[20050000,7.1981343283583882E-2,6.1981343283582062E-2,5.198134328358206E-2,3.698134328358206E-2]
[{"$f":"A545+10000","v":20060000},7.1977611940300293E-2,6.197761194029848E-2,5.1977611940298478E-2,3.6977611940298478E-2]
[{"$f":"A546+10000","v":20070000},7.1973880597016704E-2,6.1973880597014898E-2,5.1973880597014896E-2,3.6973880597014896E-2]
[20080000,7.1970149253733115E-2,6.1970149253731316E-2,5.1970149253731314E-2,3.6970149253731314E-2]
[20090000,7.1966417910449526E-2,6.1966417910447734E-2,5.1966417910447732E-2,3.6966417910447733E-2]
[20100000,7.1962686567165937E-2,6.1962686567164152E-2,5.196268656716415E-2,3.6962686567164151E-2]
[{"$f":"A550+10000","v":20110000},7.1958955223882348E-2,6.195895522388057E-2,5.1958955223880568E-2,3.6958955223880569E-2]
[{"$f":"A551+10000","v":20120000},7.1955223880598759E-2,6.1955223880596988E-2,5.1955223880596986E-2,3.6955223880596987E-2]
[20130000,7.195149253731517E-2,6.1951492537313406E-2,5.1951492537313404E-2,3.6951492537313405E-2]
[20140000,7.1947761194031581E-2,6.1947761194029824E-2,5.1947761194029822E-2,3.6947761194029823E-2]
[20150000,7.1944029850747993E-2,6.1944029850746242E-2,5.194402985074624E-2,3.6944029850746241E-2]
[{"$f":"A555+10000","v":20160000},7.1940298507464404E-2,6.194029850746266E-2,5.1940298507462658E-2,3.6940298507462659E-2]
[{"$f":"A556+10000","v":20170000},7.1936567164180815E-2,{"$f":"C558+(0.001/268)","v":6.1936567164179078E-2},5.1936567164179076E-2,3.6936567164179077E-2]
[20180000,7.1932835820897226E-2,6.1932835820895496E-2,5.1932835820895494E-2,3.6932835820895495E-2]
[20190000,7.1929104477613637E-2,6.1929104477611914E-2,5.1929104477611912E-2,3.6929104477611913E-2]
[20200000,7.1925373134330048E-2,6.1925373134328332E-2,5.192537313432833E-2,3.6925373134328331E-2]
[{"$f":"A560+10000","v":20210000},7.1921641791046459E-2,6.192164179104475E-2,5.1921641791044748E-2,3.6921641791044749E-2]
[{"$f":"A561+10000","v":20220000},7.191791044776287E-2,6.1917910447761168E-2,5.1917910447761166E-2,3.6917910447761167E-2]
[20230000,7.1914179104479281E-2,6.1914179104477586E-2,5.1914179104477584E-2,3.6914179104477585E-2]
[20240000,7.1910447761195692E-2,6.1910447761194004E-2,5.1910447761194002E-2,3.6910447761194003E-2]
[20250000,7.1906716417912103E-2,6.1906716417910422E-2,5.190671641791042E-2,3.6906716417910421E-2]
[{"$f":"A565+10000","v":20260000},7.1902985074628514E-2,6.190298507462684E-2,5.1902985074626838E-2,3.6902985074626839E-2]
[{"$f":"A566+10000","v":20270000},7.1899253731344925E-2,6.1899253731343258E-2,5.1899253731343256E-2,3.6899253731343257E-2]
[20280000,7.1895522388061336E-2,6.1895522388059676E-2,5.1895522388059674E-2,3.6895522388059675E-2]
[20290000,7.1891791044777748E-2,6.1891791044776094E-2,5.1891791044776092E-2,3.6891791044776093E-2]
[20300000,7.1888059701494159E-2,6.1888059701492512E-2,5.188805970149251E-2,3.6888059701492511E-2]
[{"$f":"A570+10000","v":20310000},7.188432835821057E-2,6.188432835820893E-2,5.1884328358208928E-2,3.6884328358208929E-2]
[{"$f":"A571+10000","v":20320000},7.1880597014926981E-2,6.1880597014925348E-2,5.1880597014925346E-2,3.6880597014925347E-2]
[20330000,7.1876865671643392E-2,{"$f":"C574+(0.001/268)","v":6.1876865671641766E-2},5.1876865671641764E-2,3.6876865671641765E-2]
[20340000,7.1873134328359803E-2,6.1873134328358184E-2,5.1873134328358182E-2,3.6873134328358183E-2]
[20350000,7.1869402985076214E-2,6.1869402985074602E-2,5.18694029850746E-2,3.6869402985074601E-2]
[{"$f":"A575+10000","v":20360000},7.1865671641792625E-2,6.186567164179102E-2,5.1865671641791018E-2,3.6865671641791019E-2]
[{"$f":"A576+10000","v":20370000},7.1861940298509036E-2,6.1861940298507438E-2,5.1861940298507436E-2,3.6861940298507437E-2]
[20380000,7.1858208955225447E-2,6.1858208955223856E-2,5.1858208955223854E-2,3.6858208955223855E-2]
[20390000,7.1854477611941858E-2,6.1854477611940274E-2,5.1854477611940272E-2,3.6854477611940273E-2]
[20400000,7.1850746268658269E-2,6.1850746268656692E-2,5.185074626865669E-2,3.6850746268656691E-2]
[{"$f":"A580+10000","v":20410000},7.184701492537468E-2,6.184701492537311E-2,5.1847014925373108E-2,3.6847014925373109E-2]
[{"$f":"A581+10000","v":20420000},7.1843283582091091E-2,6.1843283582089528E-2,5.1843283582089526E-2,3.6843283582089527E-2]
[20430000,7.1839552238807503E-2,6.1839552238805946E-2,5.1839552238805944E-2,3.6839552238805945E-2]
[20440000,7.1835820895523914E-2,6.1835820895522364E-2,5.1835820895522362E-2,3.6835820895522363E-2]
[20450000,7.1832089552240325E-2,6.1832089552238782E-2,5.183208955223878E-2,3.6832089552238781E-2]
[{"$f":"A585+10000","v":20460000},7.1828358208956736E-2,6.18283582089552E-2,5.1828358208955198E-2,3.6828358208955199E-2]
[{"$f":"A586+10000","v":20470000},7.1824626865673147E-2,6.1824626865671618E-2,5.1824626865671616E-2,3.6824626865671617E-2]
[20480000,7.1820895522389558E-2,6.1820895522388036E-2,5.1820895522388034E-2,3.6820895522388035E-2]
[20490000,7.1817164179105969E-2,{"$f":"C590+(0.001/268)","v":6.1817164179104454E-2},5.1817164179104452E-2,3.6817164179104453E-2]
[20500000,7.181343283582238E-2,6.1813432835820872E-2,5.181343283582087E-2,3.6813432835820871E-2]
[{"$f":"A590+10000","v":20510000},7.1809701492538791E-2,6.180970149253729E-2,5.1809701492537288E-2,3.6809701492537289E-2]
[{"$f":"A591+10000","v":20520000},7.1805970149255202E-2,6.1805970149253708E-2,5.1805970149253706E-2,3.6805970149253707E-2]
[20530000,7.1802238805971613E-2,6.1802238805970126E-2,5.1802238805970124E-2,3.6802238805970125E-2]
[20540000,7.1798507462688024E-2,6.1798507462686544E-2,5.1798507462686542E-2,3.6798507462686543E-2]
[20550000,7.1794776119404435E-2,6.1794776119402962E-2,5.179477611940296E-2,3.6794776119402961E-2]
[{"$f":"A595+10000","v":20560000},7.1791044776120846E-2,6.179104477611938E-2,5.1791044776119378E-2,3.6791044776119379E-2]
[{"$f":"A596+10000","v":20570000},7.1787313432837258E-2,6.1787313432835798E-2,5.1787313432835796E-2,3.6787313432835797E-2]
[20580000,7.1783582089553669E-2,6.1783582089552216E-2,5.1783582089552214E-2,3.6783582089552215E-2]
[20590000,7.177985074627008E-2,6.1779850746268634E-2,5.1779850746268632E-2,3.6779850746268633E-2]
[20600000,7.1776119402986491E-2,6.1776119402985052E-2,5.177611940298505E-2,3.6776119402985051E-2]
[{"$f":"A600+10000","v":20610000},7.1772388059702902E-2,6.177238805970147E-2,5.1772388059701469E-2,3.6772388059701469E-2]
[{"$f":"A601+10000","v":20620000},7.1768656716419313E-2,6.1768656716417888E-2,5.1768656716417887E-2,3.6768656716417887E-2]
[20630000,7.1764925373135724E-2,6.1764925373134306E-2,5.1764925373134305E-2,3.6764925373134305E-2]
[20640000,7.1761194029852135E-2,6.1761194029850724E-2,5.1761194029850723E-2,3.6761194029850723E-2]
[20650000,{"$f":"B606+(0.001/268)","v":7.1757462686568546E-2},{"$f":"C606+(0.001/268)","v":6.1757462686567142E-2},5.1757462686567141E-2,3.6757462686567141E-2]
[{"$f":"A605+10000","v":20660000},7.1753731343284957E-2,6.1753731343283561E-2,5.1753731343283559E-2,3.6753731343283559E-2]
[{"$f":"A606+10000","v":20670000},7.1750000000001368E-2,6.1749999999999979E-2,5.1749999999999977E-2,3.6749999999999977E-2]
[20680000,7.1746268656717779E-2,6.1746268656716397E-2,5.1746268656716395E-2,3.6746268656716395E-2]
[20690000,7.174253731343419E-2,6.1742537313432815E-2,5.1742537313432813E-2,3.6742537313432813E-2]
[20700000,7.1738805970150601E-2,6.1738805970149233E-2,5.1738805970149231E-2,3.6738805970149231E-2]
[{"$f":"A610+10000","v":20710000},7.1735074626867013E-2,6.1735074626865651E-2,5.1735074626865649E-2,3.6735074626865649E-2]
[{"$f":"A611+10000","v":20720000},7.1731343283583424E-2,6.1731343283582069E-2,5.1731343283582067E-2,3.6731343283582067E-2]
[20730000,7.1727611940299835E-2,6.1727611940298487E-2,5.1727611940298485E-2,3.6727611940298485E-2]
[20740000,7.1723880597016246E-2,6.1723880597014905E-2,5.1723880597014903E-2,3.6723880597014903E-2]
[20750000,7.1720149253732657E-2,6.1720149253731323E-2,5.1720149253731321E-2,3.6720149253731321E-2]
[{"$f":"A615+10000","v":20760000},7.1716417910449068E-2,6.1716417910447741E-2,5.1716417910447739E-2,3.6716417910447739E-2]
[{"$f":"A616+10000","v":20770000},7.1712686567165479E-2,6.1712686567164159E-2,5.1712686567164157E-2,3.6712686567164157E-2]
[20780000,7.170895522388189E-2,6.1708955223880577E-2,5.1708955223880575E-2,3.6708955223880575E-2]
[20790000,7.1705223880598301E-2,6.1705223880596995E-2,5.1705223880596993E-2,3.6705223880596993E-2]
[20800000,7.1701492537314712E-2,6.1701492537313413E-2,5.1701492537313411E-2,3.6701492537313411E-2]
[{"$f":"A620+10000","v":20810000},7.1697761194031123E-2,{"$f":"C622+(0.001/268)","v":6.1697761194029831E-2},5.1697761194029829E-2,3.6697761194029829E-2]
[{"$f":"A621+10000","v":20820000},7.1694029850747534E-2,6.1694029850746249E-2,5.1694029850746247E-2,3.6694029850746247E-2]
[20830000,7.1690298507463945E-2,6.1690298507462667E-2,5.1690298507462665E-2,3.6690298507462665E-2]
[20840000,7.1686567164180356E-2,6.1686567164179085E-2,5.1686567164179083E-2,3.6686567164179083E-2]
[20850000,7.1682835820896768E-2,6.1682835820895503E-2,5.1682835820895501E-2,3.6682835820895501E-2]
[{"$f":"A625+50000","v":20900000},7.1679104477613179E-2,6.1679104477611921E-2,5.1679104477611919E-2,3.6679104477611919E-2]
[20950000,7.167537313432959E-2,6.1675373134328339E-2,5.1675373134328337E-2,3.6675373134328337E-2]
[21000000,7.1671641791046001E-2,6.1671641791044757E-2,5.1671641791044755E-2,3.6671641791044755E-2]
[21050000,7.1667910447762412E-2,6.1667910447761175E-2,5.1667910447761173E-2,3.6667910447761173E-2]
[21100000,7.1664179104478823E-2,6.1664179104477593E-2,5.1664179104477591E-2,3.6664179104477591E-2]
[21150000,7.1660447761195234E-2,6.1660447761194011E-2,5.1660447761194009E-2,3.6660447761194009E-2]
[21200000,7.1656716417911645E-2,6.1656716417910429E-2,5.1656716417910427E-2,3.6656716417910427E-2]
[21250000,7.1652985074628056E-2,6.1652985074626847E-2,5.1652985074626845E-2,3.6652985074626845E-2]
[21300000,7.1649253731344467E-2,6.1649253731343265E-2,5.1649253731343263E-2,3.6649253731343263E-2]
[21350000,7.1645522388060878E-2,6.1645522388059683E-2,5.1645522388059681E-2,3.6645522388059681E-2]
[21400000,7.1641791044777289E-2,6.1641791044776101E-2,5.1641791044776099E-2,3.6641791044776099E-2]
[21450000,7.16380597014937E-2,{"$f":"C638+(0.001/268)","v":6.1638059701492519E-2},5.1638059701492517E-2,3.6638059701492517E-2]
[21500000,7.1634328358210111E-2,6.1634328358208937E-2,5.1634328358208935E-2,3.6634328358208935E-2]
[21550000,7.1630597014926523E-2,6.1630597014925355E-2,5.1630597014925353E-2,3.6630597014925353E-2]
[21600000,7.1626865671642934E-2,6.1626865671641773E-2,5.1626865671641771E-2,3.6626865671641771E-2]
[21650000,7.1623134328359345E-2,6.1623134328358191E-2,5.1623134328358189E-2,3.6623134328358189E-2]
[21700000,7.1619402985075756E-2,6.1619402985074609E-2,5.1619402985074607E-2,3.6619402985074608E-2]
[21750000,7.1615671641792167E-2,6.1615671641791027E-2,5.1615671641791025E-2,3.6615671641791026E-2]
[21800000,7.1611940298508578E-2,6.1611940298507445E-2,5.1611940298507443E-2,3.6611940298507444E-2]
[21850000,7.1608208955224989E-2,6.1608208955223863E-2,5.1608208955223861E-2,3.6608208955223862E-2]
[21900000,7.16044776119414E-2,6.1604477611940281E-2,5.1604477611940279E-2,3.660447761194028E-2]
[21950000,7.1600746268657811E-2,6.1600746268656699E-2,5.1600746268656697E-2,3.6600746268656698E-2]
[22000000,7.1597014925374222E-2,6.1597014925373117E-2,5.1597014925373115E-2,3.6597014925373116E-2]
[22050000,7.1593283582090633E-2,6.1593283582089535E-2,5.1593283582089533E-2,3.6593283582089534E-2]
[22100000,7.1589552238807044E-2,6.1589552238805953E-2,5.1589552238805951E-2,3.6589552238805952E-2]
[22150000,7.1585820895523455E-2,6.1585820895522371E-2,5.1585820895522369E-2,3.658582089552237E-2]
[22200000,7.1582089552239866E-2,6.1582089552238789E-2,5.1582089552238787E-2,3.6582089552238788E-2]
[22250000,7.1578358208956278E-2,{"$f":"C654+(0.001/268)","v":6.1578358208955207E-2},5.1578358208955205E-2,3.6578358208955206E-2]
[22300000,7.1574626865672689E-2,6.1574626865671625E-2,5.1574626865671623E-2,3.6574626865671624E-2]
[22350000,7.15708955223891E-2,6.1570895522388043E-2,5.1570895522388041E-2,3.6570895522388042E-2]
[22400000,7.1567164179105511E-2,6.1567164179104461E-2,5.1567164179104459E-2,3.656716417910446E-2]
[22450000,7.1563432835821922E-2,6.1563432835820879E-2,5.1563432835820877E-2,3.6563432835820878E-2]
[22500000,7.1559701492538333E-2,6.1559701492537297E-2,5.1559701492537295E-2,3.6559701492537296E-2]
[22550000,7.1555970149254744E-2,6.1555970149253715E-2,5.1555970149253713E-2,3.6555970149253714E-2]
[22600000,7.1552238805971155E-2,6.1552238805970133E-2,5.1552238805970131E-2,3.6552238805970132E-2]
[22650000,7.1548507462687566E-2,6.1548507462686551E-2,5.1548507462686549E-2,3.654850746268655E-2]
[22700000,7.1544776119403977E-2,6.1544776119402969E-2,5.1544776119402967E-2,3.6544776119402968E-2]
[22750000,7.1541044776120388E-2,6.1541044776119387E-2,5.1541044776119385E-2,3.6541044776119386E-2]
[22800000,7.1537313432836799E-2,6.1537313432835805E-2,5.1537313432835803E-2,3.6537313432835804E-2]
[22850000,7.153358208955321E-2,6.1533582089552223E-2,5.1533582089552221E-2,3.6533582089552222E-2]
[22900000,7.1529850746269621E-2,6.1529850746268641E-2,5.1529850746268639E-2,3.652985074626864E-2]
[22950000,7.1526119402986033E-2,6.1526119402985059E-2,5.1526119402985057E-2,3.6526119402985058E-2]
[23000000,7.1522388059702444E-2,6.1522388059701477E-2,5.1522388059701475E-2,3.6522388059701476E-2]
[23050000,{"$f":"B670+(0.001/268)","v":7.1518656716418855E-2},{"$f":"C670+(0.001/268)","v":6.1518656716417895E-2},5.1518656716417893E-2,3.6518656716417894E-2]
[23100000,7.1514925373135266E-2,6.1514925373134313E-2,5.1514925373134311E-2,3.6514925373134312E-2]
[23150000,7.1511194029851677E-2,6.1511194029850731E-2,5.1511194029850729E-2,3.651119402985073E-2]
[23200000,7.1507462686568088E-2,6.1507462686567149E-2,5.1507462686567147E-2,3.6507462686567148E-2]
[23250000,7.1503731343284499E-2,6.1503731343283567E-2,5.1503731343283565E-2,3.6503731343283566E-2]
[23300000,7.150000000000091E-2,6.1499999999999985E-2,5.1499999999999983E-2,3.6499999999999984E-2]
[23350000,7.1496268656717321E-2,6.1496268656716403E-2,5.1496268656716401E-2,3.6496268656716402E-2]
[23400000,7.1492537313433732E-2,6.1492537313432821E-2,5.1492537313432819E-2,3.649253731343282E-2]
[23450000,7.1488805970150143E-2,6.1488805970149239E-2,5.1488805970149237E-2,3.6488805970149238E-2]
[23500000,7.1485074626866554E-2,6.1485074626865657E-2,5.1485074626865655E-2,3.6485074626865656E-2]
[23550000,7.1481343283582965E-2,6.1481343283582075E-2,5.1481343283582073E-2,3.6481343283582074E-2]
[23600000,7.1477611940299376E-2,6.1477611940298493E-2,5.1477611940298491E-2,3.6477611940298492E-2]
[23650000,7.1473880597015788E-2,6.1473880597014911E-2,5.1473880597014909E-2,3.647388059701491E-2]
[23700000,7.1470149253732199E-2,6.1470149253731329E-2,5.1470149253731327E-2,3.6470149253731328E-2]
[23750000,7.146641791044861E-2,6.1466417910447747E-2,5.1466417910447745E-2,3.6466417910447746E-2]
[23800000,7.1462686567165021E-2,6.1462686567164165E-2,5.1462686567164163E-2,3.6462686567164164E-2]
[23850000,7.1458955223881432E-2,{"$f":"C686+(0.001/268)","v":6.1458955223880583E-2},5.1458955223880581E-2,3.6458955223880582E-2]
[23900000,7.1455223880597843E-2,6.1455223880597001E-2,5.1455223880596999E-2,3.6455223880597E-2]
[23950000,7.1451492537314254E-2,6.1451492537313419E-2,5.1451492537313417E-2,3.6451492537313418E-2]
[24000000,7.1447761194030665E-2,6.1447761194029837E-2,5.1447761194029835E-2,3.6447761194029836E-2]
[24050000,7.1444029850747076E-2,6.1444029850746255E-2,5.1444029850746253E-2,3.6444029850746254E-2]
[{"$f":"A689+50000","v":24100000},7.1440298507463487E-2,6.1440298507462673E-2,5.1440298507462671E-2,3.6440298507462672E-2]
[24150000,7.1436567164179898E-2,6.1436567164179091E-2,5.1436567164179089E-2,3.643656716417909E-2]
[24200000,7.1432835820896309E-2,6.1432835820895509E-2,5.1432835820895507E-2,3.6432835820895508E-2]
[24250000,7.142910447761272E-2,6.1429104477611927E-2,5.1429104477611925E-2,3.6429104477611926E-2]
[24300000,7.1425373134329131E-2,6.1425373134328345E-2,5.1425373134328344E-2,3.6425373134328344E-2]
[24350000,7.1421641791045543E-2,6.1421641791044763E-2,5.1421641791044762E-2,3.6421641791044762E-2]
[24400000,7.1417910447761954E-2,6.1417910447761181E-2,5.141791044776118E-2,3.641791044776118E-2]
[24450000,7.1414179104478365E-2,6.1414179104477599E-2,5.1414179104477598E-2,3.6414179104477598E-2]
[24500000,7.1410447761194776E-2,6.1410447761194017E-2,5.1410447761194016E-2,3.6410447761194016E-2]
[24550000,7.1406716417911187E-2,6.1406716417910436E-2,5.1406716417910434E-2,3.6406716417910434E-2]
[24600000,7.1402985074627598E-2,6.1402985074626854E-2,5.1402985074626852E-2,3.6402985074626852E-2]
[24650000,7.1399253731344009E-2,{"$f":"C702+(0.001/268)","v":6.1399253731343272E-2},5.139925373134327E-2,3.639925373134327E-2]
[24700000,7.139552238806042E-2,6.139552238805969E-2,5.1395522388059688E-2,3.6395522388059688E-2]
[24750000,7.1391791044776831E-2,6.1391791044776108E-2,5.1391791044776106E-2,3.6391791044776106E-2]
[24800000,7.1388059701493242E-2,6.1388059701492526E-2,5.1388059701492524E-2,3.6388059701492524E-2]
[24850000,7.1384328358209653E-2,6.1384328358208944E-2,5.1384328358208942E-2,3.6384328358208942E-2]
[24900000,7.1380597014926064E-2,6.1380597014925362E-2,5.138059701492536E-2,3.638059701492536E-2]
[24950000,7.1376865671642475E-2,6.137686567164178E-2,5.1376865671641778E-2,3.6376865671641778E-2]
[25000000,7.1373134328358886E-2,6.1373134328358198E-2,5.1373134328358196E-2,3.6373134328358196E-2]
[25050000,7.1369402985075298E-2,6.1369402985074616E-2,5.1369402985074614E-2,3.6369402985074614E-2]
[25100000,7.1365671641791709E-2,6.1365671641791034E-2,5.1365671641791032E-2,3.6365671641791032E-2]
[25150000,7.136194029850812E-2,6.1361940298507452E-2,5.136194029850745E-2,3.636194029850745E-2]
[25200000,7.1358208955224531E-2,6.135820895522387E-2,5.1358208955223868E-2,3.6358208955223868E-2]
[25250000,7.1354477611940942E-2,6.1354477611940288E-2,5.1354477611940286E-2,3.6354477611940286E-2]
[25300000,7.1350746268657353E-2,6.1350746268656706E-2,5.1350746268656704E-2,3.6350746268656704E-2]
[25350000,7.1347014925373764E-2,6.1347014925373124E-2,5.1347014925373122E-2,3.6347014925373122E-2]
[25400000,7.1343283582090175E-2,6.1343283582089542E-2,5.134328358208954E-2,3.634328358208954E-2]
[25450000,7.1339552238806586E-2,{"$f":"C718+(0.001/268)","v":6.133955223880596E-2},5.1339552238805958E-2,3.6339552238805958E-2]
[25500000,7.1335820895522997E-2,6.1335820895522378E-2,5.1335820895522376E-2,3.6335820895522376E-2]
[25550000,7.1332089552239408E-2,6.1332089552238796E-2,5.1332089552238794E-2,3.6332089552238794E-2]
[25600000,7.1328358208955819E-2,6.1328358208955214E-2,5.1328358208955212E-2,3.6328358208955212E-2]
[25650000,7.132462686567223E-2,6.1324626865671632E-2,5.132462686567163E-2,3.632462686567163E-2]
[25700000,7.1320895522388641E-2,6.132089552238805E-2,5.1320895522388048E-2,3.6320895522388048E-2]
[25750000,7.1317164179105053E-2,6.1317164179104468E-2,5.1317164179104466E-2,3.6317164179104466E-2]
[25800000,7.1313432835821464E-2,6.1313432835820886E-2,5.1313432835820884E-2,3.6313432835820884E-2]
[25850000,7.1309701492537875E-2,6.1309701492537304E-2,5.1309701492537302E-2,3.6309701492537302E-2]
[25900000,7.1305970149254286E-2,6.1305970149253722E-2,5.130597014925372E-2,3.630597014925372E-2]
[25950000,7.1302238805970697E-2,6.130223880597014E-2,5.1302238805970138E-2,3.6302238805970138E-2]
[26000000,7.1298507462687108E-2,6.1298507462686558E-2,5.1298507462686556E-2,3.6298507462686556E-2]
[26050000,7.1294776119403519E-2,6.1294776119402976E-2,5.1294776119402974E-2,3.6294776119402974E-2]
[26100000,7.129104477611993E-2,6.1291044776119394E-2,5.1291044776119392E-2,3.6291044776119392E-2]
[26150000,7.1287313432836341E-2,6.1287313432835812E-2,5.128731343283581E-2,3.628731343283581E-2]
[26200000,7.1283582089552752E-2,6.128358208955223E-2,5.1283582089552228E-2,3.6283582089552228E-2]
[26250000,{"$f":"B734+(0.001/268)","v":7.1279850746269163E-2},{"$f":"C734+(0.001/268)","v":6.1279850746268648E-2},5.1279850746268646E-2,3.6279850746268646E-2]
[26300000,7.1276119402985574E-2,6.1276119402985066E-2,5.1276119402985064E-2,3.6276119402985064E-2]
[26350000,7.1272388059701985E-2,6.1272388059701484E-2,5.1272388059701482E-2,3.6272388059701482E-2]
[26400000,7.1268656716418397E-2,6.1268656716417902E-2,5.12686567164179E-2,3.6268656716417901E-2]
[26450000,7.1264925373134808E-2,6.126492537313432E-2,5.1264925373134318E-2,3.6264925373134319E-2]
[26500000,7.1261194029851219E-2,6.1261194029850738E-2,5.1261194029850736E-2,3.6261194029850737E-2]
[26550000,7.125746268656763E-2,6.1257462686567156E-2,5.1257462686567154E-2,3.6257462686567155E-2]
[26600000,7.1253731343284041E-2,6.1253731343283574E-2,5.1253731343283572E-2,3.6253731343283573E-2]
[26650000,7.1250000000000452E-2,6.1249999999999992E-2,5.124999999999999E-2,3.6249999999999991E-2]
[26700000,7.1246268656716863E-2,6.124626865671641E-2,5.1246268656716408E-2,3.6246268656716409E-2]
[26750000,7.1242537313433274E-2,6.1242537313432828E-2,5.1242537313432826E-2,3.6242537313432827E-2]
[26800000,7.1238805970149685E-2,6.1238805970149246E-2,5.1238805970149244E-2,3.6238805970149245E-2]
[26850000,7.1235074626866096E-2,6.1235074626865664E-2,5.1235074626865662E-2,3.6235074626865663E-2]
[26900000,7.1231343283582507E-2,6.1231343283582082E-2,5.123134328358208E-2,3.6231343283582081E-2]
[26950000,7.1227611940298918E-2,6.12276119402985E-2,5.1227611940298498E-2,3.6227611940298499E-2]
[27000000,7.1223880597015329E-2,6.1223880597014918E-2,5.1223880597014916E-2,3.6223880597014917E-2]
[27050000,7.122014925373174E-2,{"$f":"C750+(0.001/268)","v":6.1220149253731336E-2},5.1220149253731334E-2,3.6220149253731335E-2]
[27100000,7.1216417910448152E-2,6.1216417910447754E-2,5.1216417910447752E-2,3.6216417910447753E-2]
[27150000,7.1212686567164563E-2,6.1212686567164172E-2,5.121268656716417E-2,3.6212686567164171E-2]
[27200000,7.1208955223880974E-2,6.120895522388059E-2,5.1208955223880588E-2,3.6208955223880589E-2]
[27250000,7.1205223880597385E-2,6.1205223880597008E-2,5.1205223880597006E-2,3.6205223880597007E-2]
[{"$f":"A753+50000","v":27300000},7.1201492537313796E-2,6.1201492537313426E-2,5.1201492537313424E-2,3.6201492537313425E-2]
[27350000,7.1197761194030207E-2,6.1197761194029844E-2,5.1197761194029842E-2,3.6197761194029843E-2]
[27400000,7.1194029850746618E-2,6.1194029850746262E-2,5.119402985074626E-2,3.6194029850746261E-2]
[27450000,7.1190298507463029E-2,6.119029850746268E-2,5.1190298507462678E-2,3.6190298507462679E-2]
[27500000,7.118656716417944E-2,6.1186567164179098E-2,5.1186567164179096E-2,3.6186567164179097E-2]
[27550000,7.1182835820895851E-2,6.1182835820895516E-2,5.1182835820895514E-2,3.6182835820895515E-2]
[27600000,7.1179104477612262E-2,6.1179104477611934E-2,5.1179104477611932E-2,3.6179104477611933E-2]
[27650000,7.1175373134328673E-2,6.1175373134328352E-2,5.117537313432835E-2,3.6175373134328351E-2]
[27700000,7.1171641791045084E-2,6.117164179104477E-2,5.1171641791044768E-2,3.6171641791044769E-2]
[27750000,7.1167910447761495E-2,6.1167910447761188E-2,5.1167910447761186E-2,3.6167910447761187E-2]
[27800000,7.1164179104477907E-2,6.1164179104477606E-2,5.1164179104477604E-2,3.6164179104477605E-2]
[27850000,7.1160447761194318E-2,{"$f":"C766+(0.001/268)","v":6.1160447761194024E-2},5.1160447761194022E-2,3.6160447761194023E-2]
[27900000,7.1156716417910729E-2,6.1156716417910442E-2,5.115671641791044E-2,3.6156716417910441E-2]
[27950000,7.115298507462714E-2,6.115298507462686E-2,5.1152985074626858E-2,3.6152985074626859E-2]
[28000000,7.1149253731343551E-2,6.1149253731343278E-2,5.1149253731343276E-2,3.6149253731343277E-2]
[28050000,7.1145522388059962E-2,6.1145522388059696E-2,5.1145522388059694E-2,3.6145522388059695E-2]
[28100000,7.1141791044776373E-2,6.1141791044776114E-2,5.1141791044776112E-2,3.6141791044776113E-2]
[28150000,7.1138059701492784E-2,6.1138059701492532E-2,5.113805970149253E-2,3.6138059701492531E-2]
[28200000,7.1134328358209195E-2,6.113432835820895E-2,5.1134328358208948E-2,3.6134328358208949E-2]
[28250000,7.1130597014925606E-2,6.1130597014925368E-2,5.1130597014925366E-2,3.6130597014925367E-2]
[28300000,7.1126865671642017E-2,6.1126865671641786E-2,5.1126865671641784E-2,3.6126865671641785E-2]
[28350000,7.1123134328358428E-2,6.1123134328358204E-2,5.1123134328358202E-2,3.6123134328358203E-2]
[28400000,7.1119402985074839E-2,6.1119402985074622E-2,5.111940298507462E-2,3.6119402985074621E-2]
[28450000,7.111567164179125E-2,6.111567164179104E-2,5.1115671641791038E-2,3.6115671641791039E-2]
[28500000,7.1111940298507662E-2,6.1111940298507458E-2,5.1111940298507456E-2,3.6111940298507457E-2]
[28550000,7.1108208955224073E-2,6.1108208955223876E-2,5.1108208955223874E-2,3.6108208955223875E-2]
[28600000,7.1104477611940484E-2,6.1104477611940294E-2,5.1104477611940292E-2,3.6104477611940293E-2]
[28650000,7.1100746268656895E-2,{"$f":"C782+(0.001/268)","v":6.1100746268656712E-2},5.110074626865671E-2,3.6100746268656711E-2]
[28700000,7.1097014925373306E-2,6.109701492537313E-2,5.1097014925373128E-2,3.6097014925373129E-2]
[28750000,7.1093283582089717E-2,6.1093283582089548E-2,5.1093283582089546E-2,3.6093283582089547E-2]
[28800000,7.1089552238806128E-2,6.1089552238805966E-2,5.1089552238805964E-2,3.6089552238805965E-2]
[28850000,7.1085820895522539E-2,6.1085820895522384E-2,5.1085820895522382E-2,3.6085820895522383E-2]
[28900000,7.108208955223895E-2,6.1082089552238802E-2,5.10820895522388E-2,3.6082089552238801E-2]
[28950000,7.1078358208955361E-2,6.107835820895522E-2,5.1078358208955219E-2,3.6078358208955219E-2]
[29000000,7.1074626865671772E-2,6.1074626865671638E-2,5.1074626865671637E-2,3.6074626865671637E-2]
[29050000,7.1070895522388183E-2,6.1070895522388056E-2,5.1070895522388055E-2,3.6070895522388055E-2]
[29100000,7.1067164179104594E-2,6.1067164179104474E-2,5.1067164179104473E-2,3.6067164179104473E-2]
[29150000,7.1063432835821005E-2,6.1063432835820892E-2,5.1063432835820891E-2,3.6063432835820891E-2]
[29200000,7.1059701492537417E-2,6.105970149253731E-2,5.1059701492537309E-2,3.6059701492537309E-2]
[29250000,7.1055970149253828E-2,6.1055970149253729E-2,5.1055970149253727E-2,3.6055970149253727E-2]
[29300000,7.1052238805970239E-2,6.1052238805970147E-2,5.1052238805970145E-2,3.6052238805970145E-2]
[29350000,7.104850746268665E-2,6.1048507462686565E-2,5.1048507462686563E-2,3.6048507462686563E-2]
[29400000,7.1044776119403061E-2,6.1044776119402983E-2,5.1044776119402981E-2,3.6044776119402981E-2]
[29450000,{"$f":"B798+(0.001/268)","v":7.1041044776119472E-2},{"$f":"C798+(0.001/268)","v":6.1041044776119401E-2},5.1041044776119399E-2,3.6041044776119399E-2]
[29500000,7.1037313432835883E-2,6.1037313432835819E-2,5.1037313432835817E-2,3.6037313432835817E-2]
[29550000,7.1033582089552294E-2,6.1033582089552237E-2,5.1033582089552235E-2,3.6033582089552235E-2]
[29600000,7.1029850746268705E-2,6.1029850746268655E-2,5.1029850746268653E-2,3.6029850746268653E-2]
[29650000,7.1026119402985116E-2,6.1026119402985073E-2,5.1026119402985071E-2,3.6026119402985071E-2]
[29700000,7.1022388059701527E-2,6.1022388059701491E-2,5.1022388059701489E-2,3.6022388059701489E-2]
[29750000,7.1018656716417938E-2,6.1018656716417909E-2,5.1018656716417907E-2,3.6018656716417907E-2]
[29800000,7.1014925373134349E-2,6.1014925373134327E-2,5.1014925373134325E-2,3.6014925373134325E-2]
[29850000,7.101119402985076E-2,6.1011194029850745E-2,5.1011194029850743E-2,3.6011194029850743E-2]
[29900000,7.1007462686567172E-2,6.1007462686567163E-2,5.1007462686567161E-2,3.6007462686567161E-2]
[29950000,7.1003731343283583E-2,6.1003731343283581E-2,5.1003731343283579E-2,3.6003731343283579E-2]
[30000000,7.0999999999999994E-2,6.0999999999999999E-2,5.0999999999999997E-2,3.5999999999999997E-2]
[{"$f":"A808+0.01","v":30000000.010000002},0,0,0,0]

{"sheet":"Phase 2","index":3,"n_rows":30,"n_cols":5,"rows_kept":30,"cut":false,"hidden":false,"merged":[[27,0,27,2],[28,0,28,2],[29,0,29,2],[8,0,8,1],[22,0,22,2],[23,0,23,2],[24,0,24,2],[25,0,25,2],[26,0,26,2],[7,0,7,1],[0,0,0,2],[2,1,2,2],[3,1,3,2],[5,0,5,1],[6,0,6,1]]}
[{"$f":"'Phase 1'!A1:C1","v":"State of New Mexico ARCHITECT RATE SCHEDULE CALCULATION SHEET"}]
["1.5.18 NMAC",null,{"$f":"'Phase 1'!C2","v":"Created 6/12/2017"}]
["Project:",{"$f":"'Phase 1'!B3","v":" "}]
["Location:",{"$f":"'Phase 1'!B4","v":" "}]
["Date:",{"$f":"TODAY()","v":"2017-06-12"}]
["Maximum Allowable Construction Cost (MACC) =",null,{"$f":"'Phase 1'!C6","v":0}]
["Building Type Group (A, B, C, D) = ",null,{"$f":"'Phase 1'!C7","v":"Select"},{"$f":"IF(C7=\" \",0,IF(C7=\"A\",2,IF(C7=\"b\",3,IF(C7=\"c\",4,IF(C7=\"d\",5,0)))))","v":0}]
["Basic Services Fee as a Percentage of MACC =",null,{"$f":"'Phase 1'!C8","v":0}]
["Maximum Architect Rate (MAR) =",null,{"$f":"'Phase 1'!C9","v":0}]
[0,"= New Mexico Gross Receipts Tax Rate",{"$f":"C9*(1+A10)","v":0}]
["Percent of Basic Fee","Design & Construction Phases","Lump Sum (without NMGRT)"]
["N/A",{"$f":"'Phase 1'!B12","v":"Programming Effort ="},{"$f":"IF('Phase 1'!A$19=1,\"N/A\",IF(A12=\"N/A\",\"Previous Phase\",IF(A12>0,C$9*A12,0)))","v":"Previous Phase"}]
[{"$f":"IF('Phase 1'!A$19=1,\"N/A\",IF('Phase 1'!A13>0,\"N/A\",0))","v":0},{"$f":"'Phase 1'!B13","v":"Schematic Design Effort ="},{"$f":"IF('Phase 1'!A$19=1,\"N/A\",IF(A13=\"N/A\",\"Previous Phase\",IF(A13>0,C$9*A13,0)))","v":0}]
[{"$f":"IF('Phase 1'!A$19=1,\"N/A\",IF('Phase 1'!A14>0,\"N/A\",0))","v":0},{"$f":"'Phase 1'!B14","v":"Design Development Effort ="},{"$f":"IF('Phase 1'!A$19=1,\"N/A\",IF(A14=\"N/A\",\"Previous Phase\",IF(A14>0,C$9*A14,0)))","v":0}]
[{"$f":"IF('Phase 1'!A$19=1,\"N/A\",IF('Phase 1'!A15>0,\"N/A\",0))","v":0},{"$f":"'Phase 1'!B15","v":"Construction Documents Effort ="},{"$f":"IF('Phase 1'!A$19=1,\"N/A\",IF(A15=\"N/A\",\"Previous Phase\",IF(A15>0,C$9*A15,0)))","v":0}]
[{"$f":"IF('Phase 1'!A$19=1,\"N/A\",IF('Phase 1'!A16>0,\"N/A\",0))","v":0},{"$f":"'Phase 1'!B16","v":"Award of Contract Effort ="},{"$f":"IF('Phase 1'!A$19=1,\"N/A\",IF(A16=\"N/A\",\"Previous Phase\",IF(A16>0,C$9*A16,0)))","v":0}]
[{"$f":"IF('Phase 1'!A$19=1,\"N/A\",IF('Phase 1'!A17>0,\"N/A\",0))","v":0},{"$f":"'Phase 1'!B17","v":"Construction Effort ="},{"$f":"IF('Phase 1'!A$19=1,\"N/A\",IF(A17=\"N/A\",\"Previous Phase\",IF(A17>0,C$9*A17,0)))","v":0}]
[{"$f":"IF('Phase 1'!A$19=1,\"N/A\",IF('Phase 1'!A18>0,\"N/A\",0))","v":0},{"$f":"'Phase 1'!B18","v":"Closeout Effort ="},{"$f":"IF('Phase 1'!A$19=1,\"N/A\",IF(A18=\"N/A\",\"Previous Phase\",IF(A18>0,C$9*A18,0)))","v":0}]
[{"$f":"SUM(A12:A18)","v":0},"PHASE TWO TOTAL =",{"$f":"IF(A19>1,\"ERROR\",SUM(C12:C18))","v":0},null,{"$f":"IF(A19>1,\"= Value exceeds MAR value in Cell C9\",\" \")","v":" "}]
[{"$f":"'Phase 1'!A19","v":0},"PHASE ONE TOTAL =",{"$f":"'Phase 1'!C19","v":0}]
[{"$f":"A19+A20","v":0},{"$f":"IF(A18=0,\"RUNNING TOTAL =\",\"TOTAL FOR PHASES ONE & TWO =\")","v":"RUNNING TOTAL ="},{"$f":"IF(A21>1,\"ERROR\",+C19+C20)","v":0},null,{"$f":"IF(A21>1,\"= Value exceeds MAR value in Cell C9\",\" \")","v":" "}]
[{"$f":"IF('Phase 1'!A$19=1,\"N/A\",IF('Phase 1'!A22>0,\"N/A\",0))","v":"N/A"},{"$f":"'Phase 1'!B22","v":0}]
["Building Types (1.5.18.9 A. NMAC)"]
["A - Specialized projects - Broadcast and telecast facility, concert hall, data processing center, detention facility, emergency operating center, fish hatchery and rearing facility, hospital, laboratory, museum, research facility."]
["B - Complex projects - Animal control facility, auditorium, church, clinic, convention center, court house, educational building (with special facilities such as trade, vocation, etc.), fitness center, laundry, library, medical center, mortuary, parking structure (enclosed), repair garage, residence (custom), restaurant, swimming pool (enclosed) synagogue, theater, transportation terminal, zoo facility."]
["C - Average projects - Apartment building, armory, bakery, bank, cafeteria, chapel, community center, dormitory, educational building (without special facilities), fire station, gymnasium, hotel, industrial building, motel, office building, parking structure (open air), police administration building, recreational building, retail store."]
["D - Simple projects - Airplane hangar, barn, comfort station, garage (without repair work), residence, stadium (open air), swimming pool (open air), warehouse."]
["General notes (1.5.18.9 B. NMAC):\n(1)     Rates for building types not listed in the building type group schedule should be negotiated from the rates indicated for buildings of similar design complexity. In instances where the owner of user has no similar facility and is not able to offer any guidance or expertise to the building to be constructed, the architect rate shall be negotiated with the architect rate schedule chart, Appendix A, only as a reference, whenever applicable.\n(2)     When a building or project includes several types of uses, the schedule rates apply to such types individually and negotiation is appropriate.\n(3)    Alterations to buildings may involve many unforeseeable conditions that may not easily be included in normal basic services. An alteration is defined as any change, architectural, structural, mechanical, or electrical, made to an existing building, and includes portions of buildings altered as a result of a new wing extension of such building, excluding historical restorations. Negotiation of the architect's rate for alterations in all categories is appropriate. Consideration of whether there are \"trade-offs\" in the scope of services should be taken.\n(4)     Historical renovation projects as a general rule require services substantially in excess of those cited as basic services. These services can include investigative analysis of existing systems, demolition planning and coordination, historical data collection and other coordination. Other instances may not address serious modification of structural systems, finishes, etc. Negotiation of the architect rates is appropriate for all categories of building types whenever the primary architectural services are for historic building renovation."]
["(5)    Where multi-contract of fast-track construction contracts are deemed to be in the best interest of the state and are required in writing by the state, negotiation of the fee is appropriate. Multi-contract or fast-track projects as a general rule require higher levels of coordination, additional personnel, increased levels of construction observation, and accelerated time schedules, all of which may increase the costs of architectural activities.\n(6)     On projects not requiring full basic services (such as fixtures, equipment, furnishings, interior displays, memorials, reroofing, etc.), when not a part of an overall building, the architect rate shall be negotiated on a cost-based compensation basis by individual project.\n(7)     For projects whose major design elements are repetitive, the architect rates in all categories may be reduced to reflect the repetitive nature of the project.\n(8)     \"Residence,\" as used in building type group D, is defined as a development-type residence, namely, a single- or two-family house.\n(9)     Fees for projects under $150,000 and over $10,000,000 shall be negotiated individually on a cost-based compensation basis; this rate schedule shall not apply.\n\n"]
["http://164.64.110.239/nmac/parts/title01/01.005.0018.htm"]

{"sheet":"Phase 3","index":4,"n_rows":30,"n_cols":5,"rows_kept":30,"cut":false,"hidden":false,"merged":[[7,0,7,1],[0,0,0,2],[2,1,2,2],[3,1,3,2],[5,0,5,1],[6,0,6,1],[27,0,27,2],[28,0,28,2],[29,0,29,2],[8,0,8,1],[22,0,22,2],[23,0,23,2],[24,0,24,2],[25,0,25,2],[26,0,26,2]]}
[{"$f":"'Phase 1'!A1:C1","v":"State of New Mexico ARCHITECT RATE SCHEDULE CALCULATION SHEET"}]
["1.5.18 NMAC",null,{"$f":"'Phase 1'!C2","v":"Created 6/12/2017"}]
["Project:",{"$f":"'Phase 1'!B3","v":" "}]
["Location:",{"$f":"'Phase 1'!B4","v":" "}]
["Date:",{"$f":"TODAY()","v":"2017-06-12"}]
["Maximum Allowable Construction Cost (MACC) =",null,{"$f":"'Phase 1'!C6","v":0}]
["Building Type Group (A, B, C, D) = ",null,{"$f":"'Phase 1'!C7","v":"Select"},{"$f":"IF(C7=\" \",0,IF(C7=\"A\",2,IF(C7=\"b\",3,IF(C7=\"c\",4,IF(C7=\"d\",5,0)))))","v":0}]
["Basic Services Fee as a Percentage of MACC =",null,{"$f":"'Phase 1'!C8","v":0}]
["Maximum Architect Rate (MAR) =",null,{"$f":"IF(C8=\"Negotiable\",\"Negotiable\",C6*C8)","v":0}]
[0,"= New Mexico Gross Receipts Tax Rate",{"$f":"IF(C8=\"Negotiable\",\"N/A\",C9*(1+A10))","v":0}]
["Percent of Basic Fee","Design & Construction Phases","Lump Sum (without NMGRT)"]
["N/A",{"$f":"'Phase 1'!B12","v":"Programming Effort ="},{"$f":"IF('Phase 1'!A$19=1,\"N/A\",IF('Phase 2'!A$21=1,\"N/A\",IF(A12=\"N/A\",\"Previous Phase\",IF(A12>0,C$9*A12,0))))","v":"Previous Phase"}]
["N/A",{"$f":"'Phase 1'!B13","v":"Schematic Design Effort ="},{"$f":"IF('Phase 1'!A$19=1,\"N/A\",IF('Phase 2'!A$21=1,\"N/A\",IF(A13=\"N/A\",\"Previous Phase\",IF(A13>0,C$9*A13,0))))","v":"Previous Phase"}]
[{"$f":"IF('Phase 1'!A$19=1,\"N/A\",IF('Phase 2'!A$19=1,\"N/A\",IF('Phase 2'!A14>0,\"N/A\",0)))","v":0},{"$f":"'Phase 1'!B14","v":"Design Development Effort ="},{"$f":"IF('Phase 1'!A$19=1,\"N/A\",IF('Phase 2'!A$21=1,\"N/A\",IF(A14=\"N/A\",\"Previous Phase\",IF(A14>0,C$9*A14,0))))","v":0}]
[{"$f":"IF('Phase 1'!A$19=1,\"N/A\",IF('Phase 2'!A$19=1,\"N/A\",IF('Phase 2'!A15>0,\"N/A\",0)))","v":0},{"$f":"'Phase 1'!B15","v":"Construction Documents Effort ="},{"$f":"IF('Phase 1'!A$19=1,\"N/A\",IF('Phase 2'!A$21=1,\"N/A\",IF(A15=\"N/A\",\"Previous Phase\",IF(A15>0,C$9*A15,0))))","v":0}]
[{"$f":"IF('Phase 1'!A$19=1,\"N/A\",IF('Phase 2'!A$19=1,\"N/A\",IF('Phase 2'!A16>0,\"N/A\",0)))","v":0},{"$f":"'Phase 1'!B16","v":"Award of Contract Effort ="},{"$f":"IF('Phase 1'!A$19=1,\"N/A\",IF('Phase 2'!A$21=1,\"N/A\",IF(A16=\"N/A\",\"Previous Phase\",IF(A16>0,C$9*A16,0))))","v":0}]
[{"$f":"IF('Phase 1'!A$19=1,\"N/A\",IF('Phase 2'!A$19=1,\"N/A\",IF('Phase 2'!A17>0,\"N/A\",0)))","v":0},{"$f":"'Phase 1'!B17","v":"Construction Effort ="},{"$f":"IF('Phase 1'!A$19=1,\"N/A\",IF('Phase 2'!A$21=1,\"N/A\",IF(A17=\"N/A\",\"Previous Phase\",IF(A17>0,C$9*A17,0))))","v":0}]
[{"$f":"IF('Phase 1'!A$19=1,\"N/A\",IF('Phase 2'!A$19=1,\"N/A\",IF('Phase 2'!A18>0,\"N/A\",0)))","v":0},{"$f":"'Phase 1'!B18","v":"Closeout Effort ="},{"$f":"IF('Phase 1'!A$19=1,\"N/A\",IF('Phase 2'!A$21=1,\"N/A\",IF(A18=\"N/A\",\"Previous Phase\",IF(A18>0,C$9*A18,0))))","v":0}]
[{"$f":"SUM(A12:A18)","v":0}," PHASE THREE TOTAL =",{"$f":"IF(A19>1,\"ERROR\",SUM(C12:C18))","v":0},null,{"$f":"IF(A19>1,\"= Value exceeds MAR value in Cell C9\",\" \")","v":" "}]
[{"$f":"'Phase 2'!A21","v":0},"PHASE ONE & TWO TOTAL =",{"$f":"'Phase 2'!C21","v":0}]
[{"$f":"A19+A20","v":0},"TOTAL FOR ALL PHASES =",{"$f":"IF(A21>1,\"ERROR\",+C19+C20)","v":0},null,{"$f":"IF(A21>1,\"= Value exceeds MAR value in Cell C9\",\" \")","v":" "}]
[{"$f":"IF('Phase 1'!A$19=1,\"N/A\",IF('Phase 2'!A$19=1,\"N/A\",IF('Phase 2'!A22>0,\"N/A\",0)))","v":"N/A"},{"$f":"'Phase 1'!B22","v":0}]
["Building Types (1.5.18.9 A. NMAC)"]
["A - Specialized projects - Broadcast and telecast facility, concert hall, data processing center, detention facility, emergency operating center, fish hatchery and rearing facility, hospital, laboratory, museum, research facility."]
["B - Complex projects - Animal control facility, auditorium, church, clinic, convention center, court house, educational building (with special facilities such as trade, vocation, etc.), fitness center, laundry, library, medical center, mortuary, parking structure (enclosed), repair garage, residence (custom), restaurant, swimming pool (enclosed) synagogue, theater, transportation terminal, zoo facility."]
["C - Average projects - Apartment building, armory, bakery, bank, cafeteria, chapel, community center, dormitory, educational building (without special facilities), fire station, gymnasium, hotel, industrial building, motel, office building, parking structure (open air), police administration building, recreational building, retail store."]
["D - Simple projects - Airplane hangar, barn, comfort station, garage (without repair work), residence, stadium (open air), swimming pool (open air), warehouse."]
["General notes (1.5.18.9 B. NMAC):\n(1)     Rates for building types not listed in the building type group schedule should be negotiated from the rates indicated for buildings of similar design complexity. In instances where the owner of user has no similar facility and is not able to offer any guidance or expertise to the building to be constructed, the architect rate shall be negotiated with the architect rate schedule chart, Appendix A, only as a reference, whenever applicable.\n(2)     When a building or project includes several types of uses, the schedule rates apply to such types individually and negotiation is appropriate.\n(3)    Alterations to buildings may involve many unforeseeable conditions that may not easily be included in normal basic services. An alteration is defined as any change, architectural, structural, mechanical, or electrical, made to an existing building, and includes portions of buildings altered as a result of a new wing extension of such building, excluding historical restorations. Negotiation of the architect's rate for alterations in all categories is appropriate. Consideration of whether there are \"trade-offs\" in the scope of services should be taken.\n(4)     Historical renovation projects as a general rule require services substantially in excess of those cited as basic services. These services can include investigative analysis of existing systems, demolition planning and coordination, historical data collection and other coordination. Other instances may not address serious modification of structural systems, finishes, etc. Negotiation of the architect rates is appropriate for all categories of building types whenever the primary architectural services are for historic building renovation."]
["(5)    Where multi-contract of fast-track construction contracts are deemed to be in the best interest of the state and are required in writing by the state, negotiation of the fee is appropriate. Multi-contract or fast-track projects as a general rule require higher levels of coordination, additional personnel, increased levels of construction observation, and accelerated time schedules, all of which may increase the costs of architectural activities.\n(6)     On projects not requiring full basic services (such as fixtures, equipment, furnishings, interior displays, memorials, reroofing, etc.), when not a part of an overall building, the architect rate shall be negotiated on a cost-based compensation basis by individual project.\n(7)     For projects whose major design elements are repetitive, the architect rates in all categories may be reduced to reflect the repetitive nature of the project.\n(8)     \"Residence,\" as used in building type group D, is defined as a development-type residence, namely, a single- or two-family house.\n(9)     Fees for projects under $150,000 and over $10,000,000 shall be negotiated individually on a cost-based compensation basis; this rate schedule shall not apply.\n\n"]
["http://164.64.110.239/nmac/parts/title01/01.005.0018.htm"]